Methyl chloroformate

Phase change data

Data compiled by: Robert L. Brown and Stephen E. Stein

Quantity Value Units Method Reference Comment
Tboil343.7KN/AWeast and Grasselli, 1989

Gas phase ion energetics data

Data compiled as indicated in comments:
LBLHLM - Sharon G. Lias, John E. Bartmess, Joel F. Liebman, John L. Holmes, Rhoda D. Levin, and W. Gary Mallard
RDSH - Henry M. Rosenstock, Keith Draxl, Bruce W. Steiner, and John T. Herron

Appearance energy determinations

Ion AE (eV) Other Products MethodReferenceComment
CH3O+11.42 ± 0.05COClEIHolmes and Lossing, 1984LBLHLM
C2H3O2+11.24 ± 0.05ClEIBlanchette, Holmes, et al., 1986LBLHLM
C2H3O2+11.78 ± 0.05ClEIBriggs and Shannon, 1969RDSH

References

Weast and Grasselli, 1989
CRC Handbook of Data on Organic Compounds, 2nd Editon, Weast,R.C and Grasselli, J.G., ed(s)., CRC Press, Inc., Boca Raton, FL, 1989, 1. [all data]

Holmes and Lossing, 1984
Holmes, J.L.; Lossing, F.P., Heats of formation of organic radicals from appearance energies, Int. J. Mass Spectrom. Ion Processes, 1984, 58, 113. [all data]

Blanchette, Holmes, et al., 1986
Blanchette, M.C.; Holmes, J.L.; Hop, C.E.C.A.; Lossing, F.P.; Postma, R.; Ruttink, P.J.A.; Terlouw, J.K., Theory and experiment in concert; the CH3O-C=O+ ion and its isomers, J. Am. Chem. Soc., 1986, 108, 7589. [all data]

Briggs and Shannon, 1969
Briggs, P.R.; Shannon, T.W., The heat of formation of the methoxycarbonyl ion, J. Am. Chem. Soc., 1969, 91, 4307. [all data]