(3R,3aR,7R,8aS)-3,8,8-Trimethyl-6-methyleneoctahydro-1H-3a,7-methanoazulene

Normal alkane RI, polar column, custom temperature program

Data compiled by: NIST Mass Spectrometry Data Center, William E. Wallace, director

Column type CapillaryCapillaryCapillaryCapillaryCapillary
Active phase HP Innowax FSPHP Innowax FSPHP-Innowax FSCInnowaxInnowax FSC
Column length (m) 60.60.60.60.60.
Carrier gas HeliumHeliumHeHe
Substrate
Column diameter (mm) 0.250.250.250.250.25
Phase thickness (μm) 0.250.250.250.250.25
Program 60 0C (10 min) 4 0C/min -> 220 0C (10 min) 1 0C/min -> 240 0C (20 min)60 0C (10 min) 4 0C/min -> 220 0C (10 min) 1 0C/min -> 240 0C (20 min)60C(10min) => 4C/min => 220C(10min) => 1C/min => 240C60C(10min) => 4C/min => 220C(10min) => 1C/min => 240C (20min)60C(10min) => 4C/min => 220C(10min) => 1C/min => 240C
I 1591.1587.1594.1587.1594.
ReferenceWedge, Klun, et al., 2009Wedge, Klun, et al., 2009Sezik E., Kocakulak E., et al., 2005Tunaher, Kirimer, et al., 2003Tunalier, Kirimer, et al., 2002
Comment MSDC-RI MSDC-RI MSDC-RI MSDC-RI MSDC-RI

Kovats' RI, non-polar column, temperature ramp

Data compiled by: NIST Mass Spectrometry Data Center, William E. Wallace, director

Column type CapillaryCapillaryCapillary
Active phase CP Sil 8 CBSE-54DB-5
Column length (m) 30.30.30.
Carrier gas H2 He
Substrate
Column diameter (mm) 0.250.260.26
Phase thickness (μm) 0.250.250.25
Tstart (C) 50.60.60.
Tend (C) 220.246.246.
Heat rate (K/min) 3.3.3.
Initial hold (min) 2.
Final hold (min)
I 1422.1409.1409.
ReferenceSchwob, Bessiere, et al., 2004Adams, 2000Adams, 1999
Comment MSDC-RI MSDC-RI MSDC-RI

Van Den Dool and Kratz RI, polar column, temperature ramp

Data compiled by: NIST Mass Spectrometry Data Center, William E. Wallace, director

Column type CapillaryCapillary
Active phase BP-20BP-20
Column length (m) 50.50.
Carrier gas HeHe
Substrate
Column diameter (mm) 0.220.22
Phase thickness (μm) 0.250.25
Tstart (C) 60.60.
Tend (C) 220.220.
Heat rate (K/min) 2.2.
Initial hold (min)
Final hold (min) 20.20.
I 1618.1569.
ReferenceDuquesnoy, Dinh, et al., 2006Gonny, Cavaleiro, et al., 2006
Comment MSDC-RI MSDC-RI

Van Den Dool and Kratz RI, non-polar column, custom temperature program

Data compiled by: NIST Mass Spectrometry Data Center, William E. Wallace, director

Column type Capillary
Active phase SE-52
Column length (m) 30.
Carrier gas He
Substrate
Column diameter (mm) 0.32
Phase thickness (μm) 0.15
Program 45C => 1C/min => 100C => 5C/min => 250C(10min)
I 1416.
ReferenceBruni, Pellati, et al., 2005
Comment MSDC-RI

References

Wedge, Klun, et al., 2009
Wedge, D.E.; Klun, J.A.; Tabanca, N.; Demirci, B.; Ozek, T.; Baser, K.H.C.; Liu, Z.; Zhang, S.; Cantrell, C.L.; Zhang, J., Bioactivity-guided fractionation and GC/MS fingerprinting of Amgelica sinensis and Angelica archangelica root components for antifungal and mosquito deterrent activity, J. Agric. Food Chem., 2009, 57, 2, 464-470, https://doi.org/10.1021/jf802820d . [all data]

Sezik E., Kocakulak E., et al., 2005
Sezik E.; Kocakulak E.; Baser K.H.C.; Ozek T., Composition of the essential oils of Juniperus oxycedrus subsp macrocarpa from Turkey, Chem. Nat. Compd. (Engl. Transl.), 2005, 41, 3, 352-354, https://doi.org/10.1007/s10600-005-0149-0 . [all data]

Tunaher, Kirimer, et al., 2003
Tunaher, Z.; Kirimer, N.; Baser, K.H.C., Wood essential oils of Juniperus foetidissima Willd., Holzforschung, 2003, 57, 140-144. [all data]

Tunalier, Kirimer, et al., 2002
Tunalier, Z.; Kirimer, N.; Baser, K.H.C., The composition of essential oils from various parts of Juniperus foetidissima, Chem. Nat. Compd. (Engl. Transl.), 2002, 38, 1, 43-47, https://doi.org/10.1023/A:1015725630556 . [all data]