Acetamide, 2-chloro-

Condensed phase thermochemistry data

Data compiled by: Hussein Y. Afeefy, Joel F. Liebman, and Stephen E. Stein

Quantity Value Units Method Reference Comment
Δfsolid-338. ± 8.4kJ/molCcbSmith, Bjellerup, et al., 1953Heat of formation derived by Cox and Pilcher, 1970
Quantity Value Units Method Reference Comment
Δcsolid-1044. ± 8.4kJ/molCcbSmith, Bjellerup, et al., 1953Heat of formation derived by Cox and Pilcher, 1970
Δcsolid-1041.kJ/molCcbSchjanberg, 1935

References

Smith, Bjellerup, et al., 1953
Smith, L.; Bjellerup, L.; Krook, S.; Westermark, H., Heats of combustion of organic chloro compounds determined by the "quartz wool" method, Acta Chem. Scand., 1953, 7, 65. [all data]

Cox and Pilcher, 1970
Cox, J.D.; Pilcher, G., Thermochemistry of Organic and Organometallic Compounds, Academic Press, New York, 1970, 1-636. [all data]

Schjanberg, 1935
Schjanberg, E., Die Verbrennungswarmen und die Refraktionsdaten einiger chlorsubstituierter Fettsauren und Ester., Z. Phys. Chem. Abt. A, 1935, 172, 197-233. [all data]