Propane, 1,1-dichloro-

Phase change data

Data compiled as indicated in comments:
BS - Robert L. Brown and Stephen E. Stein
TRC - Thermodynamics Research Center, NIST Boulder Laboratories, Chris Muzny director
AC - William E. Acree, Jr., James S. Chickos

Quantity Value Units Method Reference Comment
Tboil361.3KN/AWeast and Grasselli, 1989BS
Tboil361.25KN/AHowlett, 1953Uncertainty assigned by TRC = 0.5 K; TRC
Tboil351.KN/ANesmeyanov and Zakharkin, 1953Uncertainty assigned by TRC = 3. K; TRC
Tboil363.15KN/AEwell and Welch, 1941Uncertainty assigned by TRC = 1. K; TRC
Tboil360.KN/AHenne, Renoll, et al., 1939Uncertainty assigned by TRC = 2. K; TRC
Quantity Value Units Method Reference Comment
Δvap35.2 ± 0.4kJ/molCVarushchenko, Druzhinina, et al., 2007AC
Δvap35.2kJ/molN/AHaccuria and Mathieu, 1967Based on data from 310. - 360. K. See also Basarová and Svoboda, 1991.; AC

In addition to the Thermodynamics Research Center (TRC) data available from this site, much more physical and chemical property data is available from the following TRC products:

References

Weast and Grasselli, 1989
CRC Handbook of Data on Organic Compounds, 2nd Editon, Weast,R.C and Grasselli, J.G., ed(s)., CRC Press, Inc., Boca Raton, FL, 1989, 1. [all data]

Howlett, 1953
Howlett, K.E., J. Chem. Soc., 1953, 1953, 945. [all data]

Nesmeyanov and Zakharkin, 1953
Nesmeyanov, A.N.; Zakharkin, L.I., Cleavage of Hydrogen Chloride from α,α,α,omega.- Tetrachloroalkanes and α,α,alpha.-Trichloroalkanes, Izvest. Akad. Nauk S.S.S.R., 1953, 1953, 988-90. [all data]

Ewell and Welch, 1941
Ewell, R.H.; Welch, L.M., Maximum Boiling Mixtures of chloroparaffins with Donor Liquids, J. Am. Chem. Soc., 1941, 63, 2475. [all data]

Henne, Renoll, et al., 1939
Henne, A.L.; Renoll, M.W.; Leicester, H.M., J. Am. Chem. Soc., 1939, 61, 938. [all data]

Varushchenko, Druzhinina, et al., 2007
Varushchenko, R.M.; Druzhinina, A.I.; Kuramshina, G.M.; Dorofeeva, O.V., Thermodynamics of vaporization of some freons and halogenated ethanes and propanes, Fluid Phase Equilibria, 2007, 256, 1-2, 112-122, https://doi.org/10.1016/j.fluid.2007.02.017 . [all data]

Haccuria and Mathieu, 1967
Haccuria, M.; Mathieu, M.P., Ind. Chim. Belg., 1967, 32, 165. [all data]

Basarová and Svoboda, 1991
Basarová, Pavlína; Svoboda, Václav, Calculation of heats of vaporization of halogenated hydrocarbons from saturated vapour pressure data, Fluid Phase Equilibria, 1991, 68, 13-34, https://doi.org/10.1016/0378-3812(91)85008-I . [all data]