6-Bromotricyclo[3.1.1.03,6]heptane

Gas phase ion energetics data

Data compiled by: Sharon G. Lias, John E. Bartmess, Joel F. Liebman, John L. Holmes, Rhoda D. Levin, and W. Gary Mallard

Ionization energy determinations

IE (eV) Method Reference Comment
8.7PEAbeywickrema, Della, et al., 1984
9.27 ± 0.01PEAbeywickrema, Della, et al., 1984Vertical value

References

Abeywickrema, Della, et al., 1984
Abeywickrema, R.S.; Della, E.W.; Pigou, P.E.; Livett, M.K.; Peel, J.B., Orbital interactions in some polycycloalkyl halides: A photoelectron spectroscopic study, J. Am. Chem. Soc., 1984, 106, 7321. [all data]