Perfluoro(methoxycyclopentane)

Phase change data

Data compiled by: William E. Acree, Jr., James S. Chickos

Enthalpy of vaporization

ΔvapH (kJ/mol) Temperature (K) Method Reference Comment
38.6261.AStephenson and Malanowski, 1987Based on data from 246. - 330. K. See also Dykyj, 1972.
30.3330.N/APorter and Cady, 1957

References

Stephenson and Malanowski, 1987
Stephenson, Richard M.; Malanowski, Stanislaw, Handbook of the Thermodynamics of Organic Compounds, 1987, https://doi.org/10.1007/978-94-009-3173-2 . [all data]

Dykyj, 1972
Dykyj, J., Petrochemia, 1972, 12, 1, 13. [all data]

Porter and Cady, 1957
Porter, Roger S.; Cady, George H., Some Chemical Reactions of Trifluoromethyl Hypofluorite 1, J. Am. Chem. Soc., 1957, 79, 21, 5625-5627, https://doi.org/10.1021/ja01578a012 . [all data]