[1,1'-biphenyl]-4,4'-dicarboxylic acid

Phase change data

Data compiled by: William E. Acree, Jr., James S. Chickos

Quantity Value Units Method Reference Comment
Δsub46.9 ± 1.7kcal/molCMatos, Miranda, et al., 2004

References

Matos, Miranda, et al., 2004
Matos, M. Agostinha R.; Miranda, Margarida S.; Martins, Diana V.S.S.; Pinto, Nat«65533»lia A.B.; Morais, Victor M.F.; Liebman, Joel F., Thermochemistry of biphenylcarboxylic and dicarboxylic acids. A combined experimental and theoretical studyThis paper is dedicated to Kurt Mislow, a pioneering biphenyl stereochemist, on the occasion of his 80th birthday., Org. Biomol. Chem., 2004, 2, 9, 1353, https://doi.org/10.1039/b401605j . [all data]