3,3.6,6-Tetraethyloctane

Phase change data

Data compiled by: William E. Acree, Jr., James S. Chickos

Quantity Value Units Method Reference Comment
Δvap74.3 ± 1.9kJ/molN/AChickos, Hesse, et al., 1995
Δvap72.3 ± 1.8kJ/molCGCChickos, Hesse, et al., 1995

Enthalpy of vaporization

ΔvapH (kJ/mol) Temperature (K) Method Reference Comment
73.0 ± 1.9308.HSAChickos, Hesse, et al., 1995Based on data from 301. - 330. K.

References

Chickos, Hesse, et al., 1995
Chickos, James S.; Hesse, Donald G.; Hosseini, Sarah; Liebman, Joel F.; David Mendenhall, G.; Verevkin, Sergej P.; Rakus, Klaus; Beckhaus, Hans-Dieter; Rüchardt, Christoph, Enthalpies of vaporization of some highly branched hydrocarbons, The Journal of Chemical Thermodynamics, 1995, 27, 6, 693-705, https://doi.org/10.1006/jcht.1995.0071 . [all data]