Silane, diethoxydimethyl-

Phase change data

Data compiled as indicated in comments:
BS - Robert L. Brown and Stephen E. Stein
AC - William E. Acree, Jr., James S. Chickos

Quantity Value Units Method Reference Comment
Tboil387.KN/APCR Inc., 1990BS
Quantity Value Units Method Reference Comment
Δvap43.1 ± 0.7kJ/molCVoronkov, Baryshok, et al., 1988AC
Δvap43.1 ± 0.3kJ/molEBKlyuchnikov, Danilova, et al., 1985AC

Enthalpy of vaporization

ΔvapH (kJ/mol) Temperature (K) Reference Comment
43.3269.Stull, 1947Based on data from 254. - 386. K.; AC

Antoine Equation Parameters

log10(P) = A − (B / (T + C))
    P = vapor pressure (bar)
    T = temperature (K)

View plot Requires a JavaScript / HTML 5 canvas capable browser.

Temperature (K) A B C Reference Comment
254.1 - 386.74.440971490.127-50.429Stull, 1947Coefficents calculated by NIST from author's data.

References

PCR Inc., 1990
PCR Inc., Research Chemicals Catalog 1990-1991, PCR Inc., Gainesville, FL, 1990, 1. [all data]

Voronkov, Baryshok, et al., 1988
Voronkov, M.G.; Baryshok, V.P.; Klyuchnikov, V.A.; Danilova, T.F.; Pepekin, V.I.; Korchagina, A.N.; Khudobin, Yu.I., Thermochemistry of organosilicon compounds, Journal of Organometallic Chemistry, 1988, 345, 1-2, 27-38, https://doi.org/10.1016/0022-328X(88)80231-6 . [all data]

Klyuchnikov, Danilova, et al., 1985
Klyuchnikov, V.A.; Danilova, T.F.; Voronkov, M.G.; D'yakov, V.M., Dokl. Phys. Chem., 1985, 281, 373. [all data]

Stull, 1947
Stull, Daniel R., Vapor Pressure of Pure Substances. Organic and Inorganic Compounds, Ind. Eng. Chem., 1947, 39, 4, 517-540, https://doi.org/10.1021/ie50448a022 . [all data]