isobutyl-n-hexyl-amine

Kovats' RI, non-polar column, isothermal

View large format table.

Column type Active phase Temperature (C) I Reference Comment
PackedApiezon L100.1095.Golovnya, Zhuravleva, et al., 1981N2, Chromosorb GAW; Column length: 2.7 m

Kovats' RI, polar column, isothermal

View large format table.

Column type Active phase Temperature (C) I Reference Comment
CapillaryPEG-40M+KF110.1214.Svetlova, Samusenko, et al., 1986

References

Golovnya, Zhuravleva, et al., 1981
Golovnya, R.V.; Zhuravleva, I.L.; Svetlova, N.I.; Grigor'eva, D.N.; Terenina, M.B.; Gutnik, S.B., Gas-chromatographic behavior of secondary isoaliphatic and alicyclic amines, J. Anal. Chem. USSR (Engl. Transl.), 1981, 36, 4, 501-505. [all data]

Svetlova, Samusenko, et al., 1986
Svetlova, N.I.; Samusenko, A.L.; Golovnya, R.V., Advantage of the universal equation over the linear equation for the calculation of retention parameters of homologous series in capillary chromatography, J. Hi. Res. Chromatogr. Chromatogr. Comm., 1986, 9, 12, 737-740, https://doi.org/10.1002/jhrc.1240091205 . [all data]