tert-butyl-n-heptyl-amine

Kovats' RI, non-polar column, isothermal

Data compiled by: NIST Mass Spectrometry Data Center, William E. Wallace, director

Column type Packed
Active phase Apiezon L
Column length (m) 2.7
Carrier gas N2
Substrate Chromosorb GAW
Column diameter (mm)
Phase thickness (μm)
Temperature (C) 100.
I 1134.
ReferenceGolovnya, Zhuravleva, et al., 1981
Comment MSDC-RI

References

Golovnya, Zhuravleva, et al., 1981
Golovnya, R.V.; Zhuravleva, I.L.; Svetlova, N.I.; Grigor'eva, D.N.; Terenina, M.B.; Gutnik, S.B., Gas-chromatographic behavior of secondary isoaliphatic and alicyclic amines, J. Anal. Chem. USSR (Engl. Transl.), 1981, 36, 4, 501-505. [all data]