7,8-Dioxabicyclo[4.2.1]nonane, 9-bromo-

Gas phase ion energetics data

Data compiled by: Sharon G. Lias, John E. Bartmess, Joel F. Liebman, John L. Holmes, Rhoda D. Levin, and W. Gary Mallard

Ionization energy determinations

IE (eV) Method Reference Comment
9.2PEGleiter, Dobler, et al., 1984Vertical value

References

Gleiter, Dobler, et al., 1984
Gleiter, R.; Dobler, W.; Eckert-Maksic, M.; Bloodworth, A.J.; Eggelte, H.J.; Cremer, D., Photoelectron spectra of dioxabicyclo[n.2.1]alkanes, J. Org. Chem., 1984, 49, 3716. [all data]