Carbamic acid, (1-methylethyl)-, 2-[[(aminocarbonyl)oxy]methyl]-2-methylpentyl ester

Normal alkane RI, non-polar column, temperature ramp

Data compiled by: NIST Mass Spectrometry Data Center, William E. Wallace, director

Column type Capillary
Active phase DB-1
Column length (m) 10.
Carrier gas He
Substrate
Column diameter (mm) 0.53
Phase thickness (μm) 2.65
Tstart (C) 130.
Tend (C) 230.
Heat rate (K/min) 5.
Initial hold (min)
Final hold (min)
I 1841.
ReferenceAnderson and Fuller, 1987
Comment MSDC-RI

References

Anderson and Fuller, 1987
Anderson, W.H.; Fuller, D.C., A simplified procedure for the isolation, characterization, and identification of weak acid and neutral drugs from whole blood, J. Anal. Toxicol., 1987, 11, 5, 198-204, https://doi.org/10.1093/jat/11.5.198 . [all data]