Benzene:hexafluorobenzene complex

Condensed phase thermochemistry data

Data compiled by: Eugene S. Domalski and Elizabeth D. Hearing

Constant pressure heat capacity of liquid

Cp,liquid (cal/mol*K) Temperature (K) Reference Comment
88.4305.Ripmeester, Wright, et al., 1978T = 60 to 320 K.

References

Ripmeester, Wright, et al., 1978
Ripmeester, J.A.; Wright, D.A.; Fyfe, C.A.; Boyd, R.K., Molecular motion and phase transitions in solid hexafluorobenzene + benzene complex by nuclear magnetic resonance and heat capacity measurements, J. Chem. Soc. Faraday Trans., 1978, II 74, 1164-1178. [all data]