Pentaerythritol Tetranitrate

Condensed phase thermochemistry data

Data compiled by: Hussein Y. Afeefy, Joel F. Liebman, and Stephen E. Stein

Quantity Value Units Method Reference Comment
Δfsolid-538.5 ± 0.8kJ/molCcbOrnellas, Carpenter, et al., 1966Heat of combustion corrected for pressure
Quantity Value Units Method Reference Comment
Δcsolid-2572.4 ± 0.8kJ/molCcbOrnellas, Carpenter, et al., 1966Heat of combustion corrected for pressure
Δcsolid-2569.8 ± 2.5kJ/molCcbBurlot, 1939Reanalyzed by Cox and Pilcher, 1970, Original value = -2594.7 kJ/mol

Phase change data

Data compiled as indicated in comments:
AC - William E. Acree, Jr., James S. Chickos
ALS - Hussein Y. Afeefy, Joel F. Liebman, and Stephen E. Stein

Quantity Value Units Method Reference Comment
Δsub150.4 ± 1.3kJ/molMECundall, Frank Palmer, et al., 1978Based on data from 328. - 405. K.; AC
Δsub152. ± 2.kJ/molVEdwards, 1953ALS

Enthalpy of sublimation

ΔsubH (kJ/mol) Temperature (K) Method Reference Comment
156.9 ± 0.8369.TELau, Hildenbrand, et al., 2004Based on data from 356. - 382. K.; AC
151.9 ± 2.1370. - 411.N/AEdwards, 1953See also Jones, 1960 and Cox and Pilcher, 1970, 2.; AC

Kovats' RI, non-polar column, isothermal

Data compiled by: NIST Mass Spectrometry Data Center, William E. Wallace, director

Column type CapillaryCapillary
Active phase DB-5DB-5
Column length (m) 30.30.
Carrier gas
Substrate
Column diameter (mm) 0.250.25
Phase thickness (μm) 0.250.25
Temperature (C) 140.140.
I 1805.541813.94
ReferenceHobbs and Conde, 1992Hobbs and Conde, 1992
Comment MSDC-RI MSDC-RI

Kovats' RI, non-polar column, custom temperature program

Data compiled by: NIST Mass Spectrometry Data Center, William E. Wallace, director

Column type Capillary
Active phase Methyl Silicone
Column length (m)
Carrier gas
Substrate
Column diameter (mm) 0.25
Phase thickness (μm)
Program not specified
I 1791.
ReferenceStaples, 2005
Comment MSDC-RI

Normal alkane RI, non-polar column, custom temperature program

Data compiled by: NIST Mass Spectrometry Data Center, William E. Wallace, director

Column type CapillaryCapillary
Active phase DB-5DB-5
Column length (m)
Carrier gas HeHe
Substrate
Column diameter (mm)
Phase thickness (μm)
Program not specifiednot specified
I 1785.1791.
ReferenceStaples, 2004Staples, 2004
Comment MSDC-RI MSDC-RI

References

Ornellas, Carpenter, et al., 1966
Ornellas, D.L.; Carpenter, J.H.; Gunn, S.R., Detonation calorimeter and results obtained with pentaerythritol tetranitrate (PETN), Rev. Sci. Instrum., 1966, 37, 907-912. [all data]

Burlot, 1939
Burlot, E., Etude relative a la calorimetrie des explosifs, Mem. Poudres, 1939, 29, 226-260. [all data]

Cox and Pilcher, 1970
Cox, J.D.; Pilcher, G., Thermochemistry of Organic and Organometallic Compounds, Academic Press, New York, 1970, 1-636. [all data]

Cundall, Frank Palmer, et al., 1978
Cundall, Robert B.; Frank Palmer, T.; Wood, Colin E.C., Vapour pressure measurements on some organic high explosives, J. Chem. Soc., Faraday Trans. 1, 1978, 74, 0, 1339, https://doi.org/10.1039/f19787401339 . [all data]

Edwards, 1953
Edwards, G., The vapour pressure of cyclo-trimethylenetrinitramine (cyclonite) and pentaerythritoltetranitrate, Trans. Faraday Soc., 1953, 49, 152. [all data]

Lau, Hildenbrand, et al., 2004
Lau, Kai H.; Hildenbrand, Donald L.; Crouch-Baker, Steven; Sanjurjo, Angel, Sublimation Pressure and Vapor Molecular Weight of Pentaerythritol Tetranitrate, J. Chem. Eng. Data, 2004, 49, 3, 544-546, https://doi.org/10.1021/je0302203 . [all data]

Jones, 1960
Jones, A.H., Sublimation Pressure Data for Organic Compounds., J. Chem. Eng. Data, 1960, 5, 2, 196-200, https://doi.org/10.1021/je60006a019 . [all data]

Cox and Pilcher, 1970, 2
Cox, J.D.; Pilcher, G., Thermochemistry of Organic and Organometallic Compounds, Academic Press Inc., London, 1970, 643. [all data]