Tetraethoxymethane

Gas phase thermochemistry data

Data compiled as indicated in comments:
ALS - Hussein Y. Afeefy, Joel F. Liebman, and Stephen E. Stein
DRB - Donald R. Burgess, Jr.

Quantity Value Units Method Reference Comment
Δfgas-861.7 ± 2.1kJ/molCcrMarsh and Mansson, 1985ALS
Δfgas-866.1kJ/molN/ALebedeva, Ryadnenko, et al., 1977Value computed using ΔfHliquid° value of -919.0±1.0 kj/mol from Lebedeva, Ryadnenko, et al., 1977 and ΔvapH° value of 52.9 kj/mol from Marsh and Mansson, 1985.; DRB

Condensed phase thermochemistry data

Data compiled by: Hussein Y. Afeefy, Joel F. Liebman, and Stephen E. Stein

Quantity Value Units Method Reference Comment
Δfliquid-914.6 ± 2.1kJ/molCcrMarsh and Mansson, 1985
Δfliquid-919. ± 1.kJ/molCcbLebedeva, Ryadnenko, et al., 1977
Quantity Value Units Method Reference Comment
Δcliquid-5486.3 ± 1.7kJ/molCcrMarsh and Mansson, 1985Corresponding Δfliquid = -913.6 kJ/mol (simple calculation by NIST; no Washburn corrections)
Δcliquid-5481. ± 2.kJ/molCcbLebedeva, Ryadnenko, et al., 1977Corresponding Δfliquid = -918.8 kJ/mol (simple calculation by NIST; no Washburn corrections)

Phase change data

Data compiled as indicated in comments:
BS - Robert L. Brown and Stephen E. Stein
ALS - Hussein Y. Afeefy, Joel F. Liebman, and Stephen E. Stein
DRB - Donald R. Burgess, Jr.
AC - William E. Acree, Jr., James S. Chickos

Quantity Value Units Method Reference Comment
Tboil432.7KN/AWeast and Grasselli, 1989BS
Quantity Value Units Method Reference Comment
Δvap52.85 ± 0.15kJ/molCMarsh and Mansson, 1985ALS
Δvap52.9kJ/molN/AMarsh and Mansson, 1985DRB
Δvap52.9 ± 0.2kJ/molCMarsh and Mansson, 1985AC
Δvap41. ± 3.kJ/molVLebedeva, Ryadnenko, et al., 1977ALS

References

Marsh and Mansson, 1985
Marsh, K.N.; Mansson, M., Standard molar enthalpies of formation of triethoxymethane and tetraethoxymethane by rotating bomb calorimetry, J. Chem. Thermodyn., 1985, 17, 995-1002. [all data]

Lebedeva, Ryadnenko, et al., 1977
Lebedeva, N.D.; Ryadnenko, V.L.; Gutner, N.M.; Nazarova, L.F.; Kiseleva, N.N.; Aizenshtadt, I.N.; Kirilenko, I.V., Possibility of using additive schemes for estimation of the enthalpies of formation of polyfunctional compounds, J. Anal. Chem. USSR (Engl. Transl.), 1977, 50, 726-729. [all data]

Weast and Grasselli, 1989
CRC Handbook of Data on Organic Compounds, 2nd Editon, Weast,R.C and Grasselli, J.G., ed(s)., CRC Press, Inc., Boca Raton, FL, 1989, 1. [all data]