bis(1,1,1-trimethyl-5,5,5-trifluoro-2,4-pentanedionato)palladium(II)

Phase change data

Data compiled by: William E. Acree, Jr., James S. Chickos

Enthalpy of sublimation

ΔsubH (kJ/mol) Temperature (K) Method Reference
131.4 ± 1.9315. - 357.MEZharkova, Stabnikov, et al., 2000

References

Zharkova, Stabnikov, et al., 2000
Zharkova, G.I.; Stabnikov, P.A.; Grankin, V.M.; Semyannikov, P.P.; Igumenov, I.K., Russ. J. Coord. Chem., 2000, 26, 8, 576. [all data]