chlorine trifluoride

Gas phase thermochemistry data

Quantity Value Units Method Reference Comment
Δfgas-37.971kcal/molReviewChase, 1998Data last reviewed in September, 1965
Quantity Value Units Method Reference Comment
gas,1 bar67.302cal/mol*KReviewChase, 1998Data last reviewed in September, 1965

Gas Phase Heat Capacity (Shomate Equation)

Cp° = A + B*t + C*t2 + D*t3 + E/t2
H° − H°298.15= A*t + B*t2/2 + C*t3/3 + D*t4/4 − E/t + F − H
S° = A*ln(t) + B*t + C*t2/2 + D*t3/3 − E/(2*t2) + G
    Cp = heat capacity (cal/mol*K)
    H° = standard enthalpy (kcal/mol)
    S° = standard entropy (cal/mol*K)
    t = temperature (K) / 1000.

View plot Requires a JavaScript / HTML 5 canvas capable browser.

View table.

Temperature (K) 298. - 1100.1100. - 6000.
A 14.4368019.84130
B 13.701200.017257
C -13.00740-0.003503
D 4.3487700.000243
E -0.197875-0.566967
F -43.44111-45.62020
G 80.1150188.56171
H -37.96991-37.96991
ReferenceChase, 1998Chase, 1998
Comment Data last reviewed in September, 1965 Data last reviewed in September, 1965

Phase change data

Data compiled as indicated in comments:
TRC - Thermodynamics Research Center, NIST Boulder Laboratories, Chris Muzny director
AC - William E. Acree, Jr., James S. Chickos

Quantity Value Units Method Reference Comment
Tboil285.1KN/AStreng, 1971Uncertainty assigned by TRC = 0.15 K; TRC
Tboil284.9KN/AWendoloski and Barber, 1958Uncertainty assigned by TRC = 0.1 K; TRC
Quantity Value Units Method Reference Comment
Tfus196.94KN/AStreng, 1971Uncertainty assigned by TRC = 0.15 K; TRC
Tfus196.81KN/AWendoloski and Barber, 1958Uncertainty assigned by TRC = 0.08 K; TRC
Quantity Value Units Method Reference Comment
Ttriple196.84KN/AGrisard, Bernhardt, et al., 1951Crystal phase 1 phase; Uncertainty assigned by TRC = 0.08 K; from melting curve in a calorimeter, To = 273.16 K; TRC

Enthalpy of vaporization

ΔvapH (kcal/mol) Temperature (K) Reference Comment
6.57313.Sako, Horiguchi, et al., 1997Based on data from 299. - 317. K.; AC
6.79288.Grisard, Bernhardt, et al., 1951, 2Based on data from 226. - 303. K.; AC

Antoine Equation Parameters

log10(P) = A − (B / (T + C))
    P = vapor pressure (atm)
    T = temperature (K)

View plot Requires a JavaScript / HTML 5 canvas capable browser.

Temperature (K) A B C Reference Comment
192.8 - 284.74.307111182.409-10.335Stull, 1947Coefficents calculated by NIST from author's data.

In addition to the Thermodynamics Research Center (TRC) data available from this site, much more physical and chemical property data is available from the following TRC products:

Vibrational and/or electronic energy levels

Data compiled by: Takehiko Shimanouchi

Symmetry:   C     Symmetry Number σ = 2

 Sym.   No   Approximate   Selected Freq.  Infrared   Raman   Comments
 Species   type of mode   Value   Rating   Value  Phase  Value  Phase

a1 1 ClF str 752  C 751 S gas 752.1 S p gas
a1 2 ClF2 s-str 529  C 530 M gas 529.3 VS p gas
a1 3 ClF2 ip-deform 328  C 328 S gas 337 W p gas OV6)
a1 3 ClF2 ip-deform 328  C 328 S gas 321 gas
b1 4 ClF2 a-str 702  C 702 VS gas
b1 5 ClF2 ip-deform 442  C 442 W gas 431 W dp gas
b2 6 ClF2 op-deform 328  D 328 S gas OV3)

Source: Shimanouchi, 1972

References

Chase, 1998
Chase, M.W., Jr., NIST-JANAF Themochemical Tables, Fourth Edition, J. Phys. Chem. Ref. Data, Monograph 9, 1998, 1-1951. [all data]

Streng, 1971
Streng, A.G., Miscibility and Compatibility of Some Liquid and Solidified Gases at Low Temperature, J. Chem. Eng. Data, 1971, 16, 357. [all data]

Wendoloski and Barber, 1958
Wendoloski, W.S.; Barber, E.J., Solid-Solid Equilibria of the System Uranium Hexafluoride-Chlorine Trifluroride, J. Phys. Chem., 1958, 62, 750. [all data]

Grisard, Bernhardt, et al., 1951
Grisard, J.W.; Bernhardt, H.A.; Oliver, G.D., Thermal data, vapor pressure and entropy of chlorine tri- fluoride., J. Am. Chem. Soc., 1951, 73, 5725. [all data]

Sako, Horiguchi, et al., 1997
Sako, Takeshi; Horiguchi, Sadashige; Ichimaru, Hiroshi; Nakagawa, Shinsuke, Vapor Pressure of Chlorine Trifluoride from 300 K to 317 K, J. Chem. Eng. Data, 1997, 42, 1, 169-171, https://doi.org/10.1021/je960286g . [all data]

Grisard, Bernhardt, et al., 1951, 2
Grisard, J.W.; Bernhardt, H.A.; Oliver, George D., Thermal Data, Vapor Pressure and Entropy of Chlorine Trifluoride 1, J. Am. Chem. Soc., 1951, 73, 12, 5725-5727, https://doi.org/10.1021/ja01156a069 . [all data]

Stull, 1947
Stull, Daniel R., Vapor Pressure of Pure Substances. Organic and Inorganic Compounds, Ind. Eng. Chem., 1947, 39, 4, 517-540, https://doi.org/10.1021/ie50448a022 . [all data]

Shimanouchi, 1972
Shimanouchi, T., Tables of Molecular Vibrational Frequencies Consolidated Volume II, J. Phys. Chem. Ref. Data, 1972, 6, 3, 993-1102. [all data]