cerium trichloride

Phase change data

Data compiled by: William E. Acree, Jr., James S. Chickos

Quantity Value Units Method Reference Comment
Δsub331. ± 5.kJ/molTEVillani, Brunetti, et al., 2000Based on data from 955. - 1070. K.

Gas phase ion energetics data

Data compiled by: Sharon G. Lias, John E. Bartmess, Joel F. Liebman, John L. Holmes, Rhoda D. Levin, and W. Gary Mallard

Ionization energy determinations

IE (eV) Method Reference Comment
11.33 ± 0.05PELee, Potts, et al., 1982Vertical value

Appearance energy determinations

Ion AE (eV) Other Products MethodReferenceComment
Ce+21.17 ± 0.063ClEISapegin, Baluev, et al., 1984

References

Villani, Brunetti, et al., 2000
Villani, Anna Rita; Brunetti, Bruno; Piacente, Vincenzo, Vapor Pressure and Enthalpies of Vaporization of Cerium Trichloride, Tribromide, and Triiodide, J. Chem. Eng. Data, 2000, 45, 5, 823-828, https://doi.org/10.1021/je000035e . [all data]

Lee, Potts, et al., 1982
Lee, E.P.F.; Potts, A.W.; Bloor, J.E., HeI and HeII photoelectron spectra of lanthanide trichlorides in the vapour phase, Proc. R. Soc. London A, 1982, 381, 373. [all data]

Sapegin, Baluev, et al., 1984
Sapegin, A.M.; Baluev, A.V.; Evdokimov, V.I., Mass-spectrometric investigation of the thermochemistry of the chlorides of the lanthanides, Russ. J. Phys. Chem., 1984, 58, 1792. [all data]