(E,E,E)-3,7,11,15-Tetramethylhexadeca-1,3,6,10,14-pentaene

Normal alkane RI, non-polar column, temperature ramp

Data compiled by: NIST Mass Spectrometry Data Center, William E. Wallace, director

Column type Capillary
Active phase HP-5MS
Column length (m) 30.
Carrier gas He
Substrate
Column diameter (mm) 0.25
Phase thickness (μm) 0.25
Tstart (C) 60.
Tend (C) 280.
Heat rate (K/min) 3.
Initial hold (min) 5.
Final hold (min)
I 2019.
ReferenceSetzer, Noletto, et al., 2006
Comment MSDC-RI

References

Setzer, Noletto, et al., 2006
Setzer, W.N.; Noletto, J.A.; Lawton, R.O., Chemical composition of the floral essential oil of Randia matudae from Monteverde, Costa Rica, Flavour Fragr. J., 2006, 21, 2, 244-246, https://doi.org/10.1002/ffj.1567 . [all data]