calcium bromide

Gas phase thermochemistry data

Quantity Value Units Method Reference Comment
Δfgas-384.93kJ/molReviewChase, 1998Data last reviewed in June, 1974
Quantity Value Units Method Reference Comment
gas,1 bar314.75J/mol*KReviewChase, 1998Data last reviewed in June, 1974

Gas Phase Heat Capacity (Shomate Equation)

Cp° = A + B*t + C*t2 + D*t3 + E/t2
H° − H°298.15= A*t + B*t2/2 + C*t3/3 + D*t4/4 − E/t + F − H
S° = A*ln(t) + B*t + C*t2/2 + D*t3/3 − E/(2*t2) + G
    Cp = heat capacity (J/mol*K)
    H° = standard enthalpy (kJ/mol)
    S° = standard entropy (J/mol*K)
    t = temperature (K) / 1000.

View plot Requires a JavaScript / HTML 5 canvas capable browser.

View table.

Temperature (K) 2500. - 6000.
A 62.27507
B 0.070945
C -0.019229
D 0.001641
E -0.170873
F -404.0715
G 389.1300
H -384.9284
ReferenceChase, 1998
Comment Data last reviewed in June, 1974

Condensed phase thermochemistry data

Quantity Value Units Method Reference Comment
Δfliquid-662.99kJ/molReviewChase, 1998Data last reviewed in June, 1974
Quantity Value Units Method Reference Comment
liquid,1 bar147.84J/mol*KReviewChase, 1998Data last reviewed in June, 1974
Quantity Value Units Method Reference Comment
Δfsolid-683.25kJ/molReviewChase, 1998Data last reviewed in June, 1974
Quantity Value Units Method Reference Comment
solid129.64J/mol*KReviewChase, 1998Data last reviewed in June, 1974

Liquid Phase Heat Capacity (Shomate Equation)

Cp° = A + B*t + C*t2 + D*t3 + E/t2
H° − H°298.15= A*t + B*t2/2 + C*t3/3 + D*t4/4 − E/t + F − H
S° = A*ln(t) + B*t + C*t2/2 + D*t3/3 − E/(2*t2) + G
    Cp = heat capacity (J/mol*K)
    H° = standard enthalpy (kJ/mol)
    S° = standard entropy (J/mol*K)
    t = temperature (K) / 1000.

View plot Requires a JavaScript / HTML 5 canvas capable browser.

View table.

Temperature (K) 1015. - 2500.
A 112.9680
B -3.316762×10-9
C 1.778267×10-9
D -3.186962×10-10
E -3.026669×10-10
F -710.2842
G 255.2943
H -662.9883
ReferenceChase, 1998
Comment Data last reviewed in June, 1974

Solid Phase Heat Capacity (Shomate Equation)

Cp° = A + B*t + C*t2 + D*t3 + E/t2
H° − H°298.15= A*t + B*t2/2 + C*t3/3 + D*t4/4 − E/t + F − H
S° = A*ln(t) + B*t + C*t2/2 + D*t3/3 − E/(2*t2) + G
    Cp = heat capacity (J/mol*K)
    H° = standard enthalpy (kJ/mol)
    S° = standard entropy (J/mol*K)
    t = temperature (K) / 1000.

View plot Requires a JavaScript / HTML 5 canvas capable browser.

View table.

Temperature (K) 298. - 1015.
A 103.1402
B -71.94304
C 75.73542
D -17.10511
E -1.152400
F -715.3176
G 266.2129
H -683.2472
ReferenceChase, 1998
Comment Data last reviewed in June, 1974

Gas phase ion energetics data

Data compiled as indicated in comments:
LLK - Sharon G. Lias, Rhoda D. Levin, and Sherif A. Kafafi
LBLHLM - Sharon G. Lias, John E. Bartmess, Joel F. Liebman, John L. Holmes, Rhoda D. Levin, and W. Gary Mallard

Ionization energy determinations

IE (eV) Method Reference Comment
≤9.68PELee and Potts, 1979LLK
10.35 ± 0.03PELee and Potts, 1979Vertical value; LLK

Appearance energy determinations

Ion AE (eV) Other Products MethodReferenceComment
BrCa+10.5BrSEmons, Kiessling, et al., 1982LBLHLM

References

Chase, 1998
Chase, M.W., Jr., NIST-JANAF Themochemical Tables, Fourth Edition, J. Phys. Chem. Ref. Data, Monograph 9, 1998, 1-1951. [all data]

Lee and Potts, 1979
Lee, E.P.F.; Potts, A.W., An investigation of the valence shell electronic structure of alkaline earth halides by using Ab initio S. C. F. calculations and photoelectron spectroscopy, Proc. R. Soc. London A:, 1979, 365, 395. [all data]

Emons, Kiessling, et al., 1982
Emons, H.-H.; Kiessling, D.; Horlbeck, W., Dampfdruckmessungen und massenspektrometrische untersuchungen der gasphase uber erdalkalimetallhalogeniden, Z. Anorg. Allg. Chem., 1982, 488, 219. [all data]