2-Methoxy-4-vinylphenol

Van Den Dool and Kratz RI, polar column, temperature ramp

Data compiled by: NIST Mass Spectrometry Data Center, William E. Wallace, director

Column type CapillaryCapillaryCapillaryCapillaryCapillary
Active phase DB-WaxDB-FFAPDB-FFAPFFAPFFAP
Column length (m) 30.30.30.30.30.
Carrier gas HeHeHeHeHe
Substrate
Column diameter (mm) 0.250.250.250.250.25
Phase thickness (μm) 0.250.50.50.250.25
Tstart (C) 50.35.35.35.35.
Tend (C) 180.225.225.225.225.
Heat rate (K/min) 3.54.4.10.10.
Initial hold (min) 2.5.5.5.5.
Final hold (min) 25.30.30.25.25.
I 2203.2175.2205.2193.2178.
ReferenceBotelho, Caldeira, et al., 2007Jarunrattanasri, Theerakulkait, et al., 2007Jarunrattanasri, Theerakulkait, et al., 2007Lozano P.R., Drake M., et al., 2007Lozano P.R., Drake M., et al., 2007
Comment MSDC-RI MSDC-RI MSDC-RI MSDC-RI MSDC-RI
Column type CapillaryCapillaryCapillaryCapillaryCapillary
Active phase DB-WaxDB-WaxDB-WaxDB-FFAPFFAP
Column length (m) 30.30.30.30.30.
Carrier gas HeHeHeHe
Substrate
Column diameter (mm) 0.320.250.320.320.32
Phase thickness (μm) 0.50.50.50.240.25
Tstart (C) 40.40.40.40.40.
Tend (C) 240.250.240.240.240.
Heat rate (K/min) 7.4.7.6.6.
Initial hold (min)  5. 2.2.
Final hold (min) 5.15.5.10.10.
I 2212.2197.2210.2191.2200.
ReferenceMahattanatawee K., Perez-Cacho P.R., et al., 2007Pozo-Bayon M.A., Ruiz-Rodriguez A., et al., 2007Ruiz Perez-Cacho, Mahattanatawee, et al., 2007Scheidig, Czerny, et al., 2007Steinhaus and Schieberle, 2007
Comment MSDC-RI MSDC-RI MSDC-RI MSDC-RI MSDC-RI
Column type CapillaryCapillaryCapillaryCapillaryCapillary
Active phase DB-WaxDB-WaxCP-Wax 52CBZB-WaxDB-Wax
Column length (m) 30.30.50.30.30.
Carrier gas HeHe HeHe
Substrate
Column diameter (mm) 0.320.320.320.250.25
Phase thickness (μm) 0.50.5 0.250.25
Tstart (C) 40.40.60.50.40.
Tend (C) 265.240.220.220.250.
Heat rate (K/min) 7.5.4.4.3.
Initial hold (min)   5.1.
Final hold (min) 5.10.30.10.20.
I 2207.2199.2181.2175.2151.
ReferenceGurbuz O., Rouseff J.M., et al., 2006Lopez-Galilea I., Fournier N., et al., 2006Mahadevan and Farmer, 2006Ugliano, Bartowsky, et al., 2006Berlinet, Ducruet, et al., 2005
Comment MSDC-RI MSDC-RI MSDC-RI MSDC-RI MSDC-RI
Column type CapillaryCapillaryCapillaryCapillaryCapillary
Active phase InnowaxDB-WaxDB-WaxZB-WaxDB-Wax
Column length (m) 50.30.0.30.30.
Carrier gas HeHelium HeHe
Substrate
Column diameter (mm) 0.250.320.320.250.25
Phase thickness (μm) 0.250.500.50.150.25
Tstart (C) 50.40.40.35.40.
Tend (C) 220.240.240.220.240.
Heat rate (K/min) 2.7.7.1.86.
Initial hold (min) 3.  10.10.
Final hold (min) 20.5.5.10.25.
I 2211.2201.2212.2200.2181.
ReferenceLee, Lee, et al., 2005Bell, 2004Gocmen, Gurbuz, et al., 2004Ledauphin, Saint-Clair, et al., 2004Varming, Petersen, et al., 2004
Comment MSDC-RI MSDC-RI MSDC-RI MSDC-RI MSDC-RI
Column type CapillaryCapillaryCapillaryCapillaryCapillary
Active phase AT-WaxDB-WaxDB-WaxDB-WaxDB-Wax
Column length (m) 60.60.30.30.30.
Carrier gas HeN2HeHeHe
Substrate
Column diameter (mm) 0.320.250.320.250.32
Phase thickness (μm) 0.250.251.0.250.50
Tstart (C) 65.70.40.40.40.
Tend (C) 250.230.200.200.240.
Heat rate (K/min) 2.2.10.2.7.
Initial hold (min) 10. 5.5.
Final hold (min) 60.20.30.20.5.
I 2138.2194.2210.2180.2200.
ReferencePino, Almora, et al., 2003Choi, Kim. M.-S.L., et al., 2002Wu and Cadwallader, 2002Kim, Shin, et al., 2001Lin and Rouseff, 2001
Comment MSDC-RI MSDC-RI MSDC-RI MSDC-RI MSDC-RI
Column type CapillaryCapillaryCapillaryCapillaryCapillary
Active phase AT-WaxDB-WaxDB-WaxSupelcowax-10Supelcowax-10
Column length (m) 60.30.30.60.60.
Carrier gas HeHeHeHeHe
Substrate
Column diameter (mm) 0.320.320.320.250.25
Phase thickness (μm) 0.250.50.50.250.25
Tstart (C) 65.60.60.35.35.
Tend (C) 250.245.245.195.195.
Heat rate (K/min) 2.3.3.2.2.
Initial hold (min) 10.3.3. 5.
Final hold (min) 60.20.20.90.90.
I 2166.2180.2180.2203.2203.
ReferencePino and Marbot, 2001Wirth, Guo, et al., 2001Bureau, Baumes, et al., 2000Chung, 2000Chung, 1999
Comment MSDC-RI MSDC-RI MSDC-RI MSDC-RI MSDC-RI
Column type CapillaryCapillaryCapillaryCapillaryCapillary
Active phase DB-WaxDB-WaxDB-WaxDB-WaxCP-Wax 58CB
Column length (m) 30.30.30.30.30.
Carrier gas H2H2HeHeHe
Substrate
Column diameter (mm) 0.320.320.250.250.25
Phase thickness (μm) 1.1.0.250.250.22
Tstart (C) 40.40.50.50.40.
Tend (C) 210.210.220.240.220.
Heat rate (K/min) 3.3.4.4.3.
Initial hold (min)   3.3.
Final hold (min)   20.
I 2197.2197.2160.2181.2162.
ReferenceMoio and Addeo, 1998Moio and Addeo, 1998Humpf and Schreier, 1991Krammer, Winterhalter, et al., 1991Pabst, Barron, et al., 1991
Comment MSDC-RI MSDC-RI MSDC-RI MSDC-RI MSDC-RI
Column type CapillaryCapillaryCapillaryCapillary
Active phase DB-WaxDB-WaxDB-WaxDB-Wax
Column length (m) 30.30.30.30.
Carrier gas HeHeHeHe
Substrate
Column diameter (mm) 0.2590.2590.2590.259
Phase thickness (μm) 0.250.250.250.25
Tstart (C) 50.50.50.50.
Tend (C) 240.240.240.240.
Heat rate (K/min) 4.4.4.4.
Initial hold (min) 3.3.3.3.
Final hold (min)
I 2166.2181.2160.2181.
ReferenceSuárez, Duque, et al., 1991Suárez, Duque, et al., 1991Suárez, Duque, et al., 1991Suárez, Duque, et al., 1991
Comment MSDC-RI MSDC-RI MSDC-RI MSDC-RI

Van Den Dool and Kratz RI, polar column, custom temperature program

Data compiled by: NIST Mass Spectrometry Data Center, William E. Wallace, director

Column type CapillaryCapillaryCapillaryCapillaryCapillary
Active phase StabilwaxDB-WaxFFAPCarbowax 20MCarbowax 20M
Column length (m) 30.30.30.25.25.
Carrier gas HeH2HeH2H2
Substrate
Column diameter (mm) 0.250.320.320.320.32
Phase thickness (μm) 0.250.50.250.250.25
Program 40C => 3C/min => 100C => 5C/min => 240C(10min)60C(3min) => 2C/min => 220C => 3C/min => 245C (20min)35C(2min) => 40C/min => 60C(2min) => 6C/min => 180C => 20C/min => 230C(10min)40C (8min) => 3C/min => 180C => 20C/min => 230C40C (8min) => 3C/min => 180C => 20C/min => 230C
I 2211.2181.2206.2180.2180.
ReferenceNatali N., Chinnici F., et al., 2006Selli, Canbas, et al., 2006Fritsch and Schieberle, 2005Boido, Lloret, et al., 2003Boido, Lloret, et al., 2003
Comment MSDC-RI MSDC-RI MSDC-RI MSDC-RI MSDC-RI
Column type CapillaryCapillaryCapillaryCapillaryCapillary
Active phase FFAPDB-WaxDB-WaxDB-WaxFFAP
Column length (m) 30.30.30.30.30.
Carrier gas HeH2H2 He
Substrate
Column diameter (mm) 0.250.320.250.250.32
Phase thickness (μm) 0.250.50.250.250.25
Program 40C(1min) => 40C/min => 50C(2min) => 6C/min => 240C60C (3min) => 2C/min => 220C => 3C/min => 245C (20min)60C (3min) => 2C/min => 220C => 5C/min => 250C (15min)20C(30s) => fast => 60C => 4C/min => 220C (20min)40C(2min) => 40C/min => 60C(2min) => 6C/min => 240C(10min)
I 2203.2177.2176.2171.2194.
ReferenceJezussek, Juliano, et al., 2002Nurgel, Erten, et al., 2002Boulanger and Crouzet, 2001Cantergiani, Brevard, et al., 2001Kirchhoff and Schieberle, 2001
Comment MSDC-RI MSDC-RI MSDC-RI MSDC-RI MSDC-RI
Column type CapillaryCapillary
Active phase FFAPFFAP
Column length (m) 25.25.
Carrier gas HeHe
Substrate
Column diameter (mm) 0.320.32
Phase thickness (μm)  0.5
Program 35C (2min) => 40C/min => 60C (2min) => 6C/min => 180C => 10C/min => 240C35C (2min) => 40C/min => 60C => 6C/min => 230C (10min)
I 2200.2200.
ReferenceSteinhaus and Schieberle, 2000Fickert and Schieberle, 1998
Comment MSDC-RI MSDC-RI

Kovats' RI, polar column, temperature ramp

Data compiled by: NIST Mass Spectrometry Data Center, William E. Wallace, director

Column type CapillaryCapillaryCapillaryCapillary
Active phase DB-WaxSupelcowax-10Carbowax 20MCarbowax 20M
Column length (m) 30.60.150.50.
Carrier gas  He He
Substrate
Column diameter (mm) 0.250.250.640.28
Phase thickness (μm) 0.25
Tstart (C) 40.35.50.70.
Tend (C) 240.200.170.190.
Heat rate (K/min) 2.3.1.2.
Initial hold (min)  5.30.
Final hold (min) 40.20.
I 2156.2155.2160.2145.
ReferenceNébié, Yaméogo, et al., 2004Wong and Tie, 1993Buttery, Ling, et al., 1982Tressl, Friese, et al., 1978
Comment MSDC-RI MSDC-RI MSDC-RI MSDC-RI

Normal alkane RI, polar column, temperature ramp

Data compiled by: NIST Mass Spectrometry Data Center, William E. Wallace, director

Column type CapillaryCapillaryCapillaryCapillaryCapillary
Active phase HP-FFAPHP-InnowaxAT-WaxFFAPVF-Wax MS
Column length (m) 25.15.60.60.60.
Carrier gas HeliumHeliumHeliumHeliumHelium
Substrate
Column diameter (mm) 0.320.320.250.250.25
Phase thickness (μm) 0.500.500.250.250.25
Tstart (C) 45.40.60.45.60.
Tend (C) 220.250.280.220.220.
Heat rate (K/min) 15.3.4.5.3.
Initial hold (min)    1.5.
Final hold (min)    5.25.
I 2234.2210.2185.2190.2192.
ReferenceWanakhachornkrai and Lertsiri, 9999Puvipirom and Chaisei, 2012Kiss, Csoka, et al., 2011Piyachaiseth, Jirapakkul, et al., 2011Duarte, Dias, et al., 2010
Comment MSDC-RI MSDC-RI MSDC-RI MSDC-RI MSDC-RI
Column type CapillaryCapillaryCapillaryCapillaryCapillary
Active phase FFAPCP-WaxDB-WaxDB-WaxSupelcowax-10
Column length (m) 30.60.60.30.30.
Carrier gas HeliumHeliumHeliumHeliumHelium
Substrate
Column diameter (mm) 0.320.250.250.250.25
Phase thickness (μm) 0.250.250.500.250.25
Tstart (C) 40.50.40.40.50.
Tend (C) 240.230.210.230.240.
Heat rate (K/min) 6.6.2.3.8.
Initial hold (min) 2.2.5.2.10.
Final hold (min)  15.70.5.
I 2196.2188.2225.2172.2193.
ReferenceChristlbauer and Schieberle, 2009Mo, Fan, et al., 2009Moon and Shibamoto, 2009Zhao, Xu, et al., 2009Vichi, Romero, et al., 2008
Comment MSDC-RI MSDC-RI MSDC-RI MSDC-RI MSDC-RI
Column type CapillaryCapillaryCapillaryCapillaryCapillary
Active phase DB-WaxDB-WaxInnowaxDB-WaxTC-Wax
Column length (m) 30.15.50.30.60.
Carrier gas HeHeHeH2He
Substrate
Column diameter (mm) 0.250.320.20.320.25
Phase thickness (μm) 0.250.250.50.50.5
Tstart (C) 40.40.60.40.40.
Tend (C) 230.230.250.200.230.
Heat rate (K/min) 4.6.2.4.3.
Initial hold (min) 2.  5.8.
Final hold (min) 5.20.60.
I 2200.2168.2170.2223.2207.
ReferenceXu, Fan, et al., 2007Kishimoto, Wanikawa, et al., 2006Bendimerad and Bendiab, 2005Culleré, Escudero, et al., 2004Ishikawa, Ito, et al., 2004
Comment MSDC-RI MSDC-RI MSDC-RI MSDC-RI MSDC-RI
Column type CapillaryCapillaryCapillaryCapillaryCapillary
Active phase DB-WaxDB-WaxDB-WaxDB-WaxTC-Wax
Column length (m) 60.60.30.30.60.
Carrier gas HeHeHeH2He
Substrate
Column diameter (mm) 0.250.320.250.320.25
Phase thickness (μm) 0.250.250.250.5
Tstart (C) 40.40.40.40.80.
Tend (C) 220.230.185.200.250.
Heat rate (K/min) 3.6.4.4.4.
Initial hold (min) 5. 4.5.
Final hold (min)  20.20. 30.
I 2213.2163.2200.2230.2181.
ReferenceLópez, Ezpeleta, et al., 2004Akiyama, Murakami, et al., 2003Lee and Noble, 2003López, Ortín, et al., 2003Miyazawa and Okuno, 2003
Comment MSDC-RI MSDC-RI MSDC-RI MSDC-RI MSDC-RI
Column type CapillaryCapillaryCapillaryCapillaryCapillary
Active phase HP-FFAPDB-WaxDB-WaxDB-FFAPDB-Wax
Column length (m) 25.30.60.30.30.
Carrier gas HeHeHeHeHe
Substrate
Column diameter (mm) 0.320.250.250.320.53
Phase thickness (μm) 0.50.250.250.251.
Tstart (C) 45.40.40.40.40.
Tend (C) 220.210.210.230.225.
Heat rate (K/min) 15.5.5.6.6.
Initial hold (min)    2.5.
Final hold (min)    5.30.
I 2234.2198.2200.2200.2193.
ReferenceWanakhachornkrai and Lertsiri, 2003Kumazawa and Masuda, 2002Kumazawa and Masuda, 2002Sanz, Czerny, et al., 2002Cadwallader and Heo, 2001
Comment MSDC-RI MSDC-RI MSDC-RI MSDC-RI MSDC-RI
Column type CapillaryCapillaryCapillaryCapillaryCapillary
Active phase DB-WaxTC-WaxFFAPDB-WaxDB-Wax
Column length (m) 30.60.30.30.30.
Carrier gas HeHeHeH2H2
Substrate
Column diameter (mm) 0.530.250.320.320.32
Phase thickness (μm) 1. 0.250.50.5
Tstart (C) 40.80.40.60.60.
Tend (C) 210.250.230.245.245.
Heat rate (K/min) 5.4.6.3.3.
Initial hold (min)   2.3.3.
Final hold (min)  47.5.20.20.
I 2195.2146.2198.2187.2187.
ReferenceKumazawa and Masuda, 2001Miyazawa, Kurose, et al., 2001Czerny and Grosch, 2000Kotseridis and Baumes, 2000Kotseridis and Baumes, 2000
Comment MSDC-RI MSDC-RI MSDC-RI MSDC-RI MSDC-RI
Column type CapillaryCapillaryCapillaryCapillaryCapillary
Active phase DB-WaxDB-WaxDB-WaxDB-WaxDB-Wax
Column length (m) 25.25.30.30.60.
Carrier gas HeHeHeHe
Substrate
Column diameter (mm) 0.250.250.250.250.32
Phase thickness (μm) 0.250.250.250.25
Tstart (C) 50.50.50.50.30.
Tend (C) 200.200.240.240.170.
Heat rate (K/min) 4.4.4.4.2.
Initial hold (min) 4.4.3.3.4.
Final hold (min) 10.10.10.10.60.
I 2181.2193.2162.2174.2180.
ReferenceMorales, Duque, et al., 2000Morales, Duque, et al., 2000Parada, Duque, et al., 2000Parada, Duque, et al., 2000Buttery, Orts, et al., 1999
Comment MSDC-RI MSDC-RI MSDC-RI MSDC-RI MSDC-RI
Column type CapillaryCapillaryCapillaryCapillaryCapillary
Active phase DB-WaxDB-WaxCarbowax 20MDB-WaxDB-Wax
Column length (m) 30.60.60.60.60.
Carrier gas   HeHe
Substrate
Column diameter (mm) 0.530.250.320.250.25
Phase thickness (μm) 1.0.250.50.25
Tstart (C) 40.40.40.40.30.
Tend (C) 210.210.190.200.170.
Heat rate (K/min) 5.5.2.2.2.
Initial hold (min)   5.2.4.
Final hold (min)     30.
I 2195.2203.2173.2188.2180.
ReferenceKumazawa and Masuda, 1999Kumazawa and Masuda, 1999Lopez, Ferreira, et al., 1999Umano, Nakahara, et al., 1999Buttery and Ling, 1998
Comment MSDC-RI MSDC-RI MSDC-RI MSDC-RI MSDC-RI
Column type CapillaryCapillaryCapillaryCapillaryCapillary
Active phase Carbowax 20MCarbowax 20MDB-WaxDB-WaxTC-Wax
Column length (m) 60.60.30.30.60.
Carrier gas HeHeHeHe
Substrate
Column diameter (mm) 0.320.320.250.250.25
Phase thickness (μm) 0.50.50.250.25
Tstart (C) 40.40.50.50.80.
Tend (C) 190.190.240.240.240.
Heat rate (K/min) 2.2.4.4.3.
Initial hold (min) 5.5.3.3.5.
Final hold (min)   10.10.
I 2173.2173.2160.2162.2221.
ReferenceFerreira, Ardanuy, et al., 1998Ferreira, Lopez, et al., 1998Parada and Duque, 1998Parada and Duque, 1998Shuichi, Masazumi, et al., 1996
Comment MSDC-RI MSDC-RI MSDC-RI MSDC-RI MSDC-RI
Column type CapillaryCapillaryCapillary
Active phase Carbowax 20MCarbowax 20MCarbowax 20M
Column length (m) 150.150.150.
Carrier gas
Substrate
Column diameter (mm) 0.640.640.64
Phase thickness (μm)
Tstart (C) 50.50.50.
Tend (C) 170.170.170.
Heat rate (K/min) 1.1.1.
Initial hold (min) 30.30.30.
Final hold (min) 60.
I 2160.2160.2160.
ReferenceButtery, Ling, et al., 1983Buttery, Parker, et al., 1981Buttery and Kamm, 1980
Comment MSDC-RI MSDC-RI MSDC-RI

Van Den Dool and Kratz RI, non-polar column, custom temperature program

Data compiled by: NIST Mass Spectrometry Data Center, William E. Wallace, director

Column type CapillaryCapillaryCapillaryCapillaryCapillary
Active phase BPX-5DB-5MSDB-5DB-5MSSE-54
Column length (m) 30.30.30.30.30.
Carrier gas HeHe HeHe
Substrate
Column diameter (mm) 0.250.320.250.320.32
Phase thickness (μm) 0.250.50.250.50.25
Program 35C => 4C/min => 200C => 30C/min => 300C (3min)70C => 5C/min => 85C(1min) => 3C/min => 165C => 10C/min => 280C(3min)40C(2min) => 4C/min => 220C => 20C/min => 280C70C(1min) => 3C/min => 80C(1min) => 5C/min => 150C => 10C/min => 280C (4min)35C(2min) => 40C/min => 50C(2min) => 6C/min => 180C => 20C/min => 230C(10min)
I 1328.1330.1312.1330.1317.
ReferenceDharmawan, Kasapis, et al., 2007Varlet, Serot, et al., 2007Sampaio and Nogueira, 2006Varlet V., Knockaert C., et al., 2006Fritsch and Schieberle, 2005
Comment MSDC-RI MSDC-RI MSDC-RI MSDC-RI MSDC-RI
Column type CapillaryCapillaryCapillaryCapillaryCapillary
Active phase DB-5DB-5DB-5MSDB-5CP Sil 8 CB
Column length (m) 30.30.30.25.30.
Carrier gas HeHeH2HeHe
Substrate
Column diameter (mm) 0.250.320.250.320.32
Phase thickness (μm) 0.250.250.250.25
Program 40C(2min) => 5C/min => 100C => 4C/min => 230C(10min)40C(1min) => 40C/min => 50C(2min) => 6C/min => 240C40C (5min) => 2C/min => 200C => 5C/min => 250C (15min)35C(2min) => 40C/min => 50C(2min) => 4C/min => 240C(10min)35C (2min) => 40C/min => 50C (2min) => 6C/min => 180C => 10C/min => 240C
I 1324.1313.1301.1317.1315.
ReferenceKlesk and Qian, 2003Jezussek, Juliano, et al., 2002Boulanger and Crouzet, 2001Kirchhoff and Schieberle, 2001Steinhaus and Schieberle, 2000
Comment MSDC-RI MSDC-RI MSDC-RI MSDC-RI MSDC-RI
Column type CapillaryCapillaryCapillary
Active phase DB-5SE-54BPX-5
Column length (m) 30.25.50.
Carrier gas H2HeHe
Substrate
Column diameter (mm) 0.250.320.32
Phase thickness (μm) 0.250.50.5
Program 40C(5min) => 2C/min => 220C => 5C/min => 250C(15min)35C (2min) => 4C/min => 150C => 10C/min => 240COC => 60C/min => 60C(5min) => 4C/min => 250C(20min)
I 1292.1312.1334.
ReferenceBoulanger, Chassagne, et al., 1999Fickert and Schieberle, 1998Owens J.D., Allagheny N., et al., 1997
Comment MSDC-RI MSDC-RI MSDC-RI

References

Botelho, Caldeira, et al., 2007
Botelho, G.; Caldeira, I.; Mendes-Faia, A.; Clímaco, M.C., Evaluation of two quantitative gas chromatography-olfactometry methods for clonal red wines differentiation, Flavour Fragr. J., 2007, 22, 5, 414-420, https://doi.org/10.1002/ffj.1815 . [all data]

Jarunrattanasri, Theerakulkait, et al., 2007
Jarunrattanasri, A.; Theerakulkait, C.; Cadwallader, K.R., Aroma Components of Acid-Hydrolyzed Vegetable Protein Made by Partial Hydrolysis of Rice Bran Protein, J. Agric. Food Chem., 2007, 55, 8, 3044-3050, https://doi.org/10.1021/jf0631474 . [all data]

Lozano P.R., Drake M., et al., 2007
Lozano P.R.; Drake M.; Benitez D.; Cadwallader K.R., Instrumental and sensory characterization of heat-induced odorants in aseptically packaged soy milk, J. Agric. Food Chem., 2007, 55, 8, 3018-3026, https://doi.org/10.1021/jf0631225 . [all data]

Mahattanatawee K., Perez-Cacho P.R., et al., 2007
Mahattanatawee K.; Perez-Cacho P.R.; Davenport T.; Rouseff R., Comparison of three lychee cultivar odor profiles using gas chromatography-olfactometry and gas chromatography-sulfur detection, J. Agric. Food Chem., 2007, 55, 5, 1939-1944, https://doi.org/10.1021/jf062925p . [all data]

Pozo-Bayon M.A., Ruiz-Rodriguez A., et al., 2007
Pozo-Bayon M.A.; Ruiz-Rodriguez A.; Pernin K.; Cayot N., Influence of eggs on the aroma composition of a sponge cake and on the aroma release in model studies on flavored sponge cakes, J. Agric. Food Chem., 2007, 55, 4, 1418-1426, https://doi.org/10.1021/jf062203y . [all data]

Ruiz Perez-Cacho, Mahattanatawee, et al., 2007
Ruiz Perez-Cacho, P.; Mahattanatawee, K.; Smoot, J.M.; Rouseff, R., Identification of Sulfur Volatiles in Canned Orange Juices Lacking Orange Flavor, J. Agric. Food Chem., 2007, 55, 14, 5761-5767, https://doi.org/10.1021/jf0703856 . [all data]

Scheidig, Czerny, et al., 2007
Scheidig, C.; Czerny, M.; Schieberle, P., Changes in Key Odorants of Raw Coffee Beans during Storage under Defined Conditions, J. Agric. Food Chem., 2007, 55, 14, 5768-5775, https://doi.org/10.1021/jf070488o . [all data]

Steinhaus and Schieberle, 2007
Steinhaus, P.; Schieberle, P., Characterization of the key aroma compounds in soy sauce using approaches of molecular sensory science, J. Agric. Food Chem., 2007, 55, 15, 6262-6269, https://doi.org/10.1021/jf0709092 . [all data]

Gurbuz O., Rouseff J.M., et al., 2006
Gurbuz O.; Rouseff J.M.; Rouseff R.L., Comparison of aroma volatiles in commercial Merlot and Cabernet Sauvignon wines using gas chromatography - Olfactometry and gas chromatography - Mass spectrometry, J. Agric. Food Chem., 2006, 54, 11, 3990-3996, https://doi.org/10.1021/jf053278p . [all data]

Lopez-Galilea I., Fournier N., et al., 2006
Lopez-Galilea I.; Fournier N.; Cid C.; Guichard E., Changes in headspace volatile concentrations of coffee brews caused by the roasting process and the brewing procedure, J. Agric. Food Chem., 2006, 54, 22, 8560-8566, https://doi.org/10.1021/jf061178t . [all data]

Mahadevan and Farmer, 2006
Mahadevan, K.; Farmer, L., Key Odor Impact Compounds in Three Yeast Extract Pastes, J. Agric. Food Chem., 2006, 54, 19, 7242-7250, https://doi.org/10.1021/jf061102x . [all data]

Ugliano, Bartowsky, et al., 2006
Ugliano, M.; Bartowsky, E.J.; McCarthy, J.; Moio, L.; Henschke, P.A., Hydrolysis and Transformation of Grape Glycosidically Bound Volatile Compounds during Fermentation with Three Saccharomyces Yeast Strains, J. Agric. Food Chem., 2006, 54, 17, 6322-6331, https://doi.org/10.1021/jf0607718 . [all data]

Berlinet, Ducruet, et al., 2005
Berlinet, C.; Ducruet, V.; Brillouet, J.-M.; Reynes, M.; Brat, P., Evolution of aroma compounds from orange juice stored in polyethylene terephthalate (PET), Food Addit. Contam., 2005, 22, 2, 185-195, https://doi.org/10.1080/02652030500037860 . [all data]

Lee, Lee, et al., 2005
Lee, J.-G.; Lee, C.-G.; Kwag, J.-J.; Buglass, A.J.; Lee, G.-H., Determination of optimum conditions for the analysis of volatile components in pine needles by double-shot pyrolysis-gas chromatography-mass spectrometry, J. Chromatogr. A, 2005, 1089, 1-2, 227-234, https://doi.org/10.1016/j.chroma.2005.06.060 . [all data]

Bell, 2004
Bell, W.A.-M., Examination of Aroma Volatiles Formed from Thermal Processing of Florida Reconstituted Grapefruit Juice. A Thesis presented to the graduate school of the university of Florida in partial fulfillment of the requirements for the degree of master of science, 2004. [all data]

Gocmen, Gurbuz, et al., 2004
Gocmen, D.; Gurbuz, O.; Rouseff, R.L.; Smoot, J.M.; Dagdelen, A.F., Gas chromatographic-olfactometric characterization of aroma active compounds in sun-dried and vacuum-dried tarhana, Eur. Food Res. Technol., 2004, 218, 6, 573-578, https://doi.org/10.1007/s00217-004-0913-6 . [all data]

Ledauphin, Saint-Clair, et al., 2004
Ledauphin, J.; Saint-Clair, J.-F.; Lablanquie, O.; Guichard, H.; Founier, N.; Guichard, E.; Barillier, D., Identification of trace volatile compounds in freshly distilled calvados and cognac using preparative separations coupled with gas chromatography-mass spectrometry, J. Agric. Food Chem., 2004, 52, 16, 5124-5134, https://doi.org/10.1021/jf040052y . [all data]

Varming, Petersen, et al., 2004
Varming, C.; Petersen, M.A.; Poll, L., Comparison of isolation methods for the determination of important aroma compounds in black currant (Ribes nigrum L.) juice, using nasal impact frequency profiling, J. Agric. Food Chem., 2004, 52, 6, 1647-1652, https://doi.org/10.1021/jf035133t . [all data]

Pino, Almora, et al., 2003
Pino, J.; Almora, K.; Marbot, R., Volatile components of papaya (Carica papaya L., maradol variety) fruit, Flavour Fragr. J., 2003, 18, 6, 492-496, https://doi.org/10.1002/ffj.1248 . [all data]

Choi, Kim. M.-S.L., et al., 2002
Choi, H.-S.; Kim. M.-S.L.; Sawamura, M., Constituents of the essential oil of cnidium officinale Makino, a Korean medicinal plant, Flavour Fragr. J., 2002, 17, 1, 49-53, https://doi.org/10.1002/ffj.1038 . [all data]

Wu and Cadwallader, 2002
Wu, Y.-F.G.; Cadwallader, K.R., Characterization of the aroma of a meatlike process flavoring from soybean-based enzyme-hydrolyzed vegetable protein, J. Agric. Food Chem., 2002, 50, 10, 2900-2907, https://doi.org/10.1021/jf0114076 . [all data]

Kim, Shin, et al., 2001
Kim, T.H.; Shin, J.H.; Baek, H.H.; Lee, H.J., Volatile flavour compounds in suspension culture of Agastache rugosa Kuntze (Korean mint), J. Sci. Food Agric., 2001, 81, 6, 569-575, https://doi.org/10.1002/jsfa.845 . [all data]

Lin and Rouseff, 2001
Lin, J.; Rouseff, R.L., Characterization of aroma-impact compounds in cold-pressed grapefruit oil using time-intensity GC-olfactometry and GC-MS, Flavour Fragr. J., 2001, 16, 6, 457-463, https://doi.org/10.1002/ffj.1041 . [all data]

Pino and Marbot, 2001
Pino, J.A.; Marbot, R., Volatile flavor constituents of acerola (Malpighia emarginata DC.) fruit, J. Agric. Food Chem., 2001, 49, 12, 5880-5882, https://doi.org/10.1021/jf010270g . [all data]

Wirth, Guo, et al., 2001
Wirth, J.; Guo, W.; Baumes, R.; Günata, Z., Volatile compounds released by enzymatic hydrolysis of glycoconjugates of leaves and grape berries from Vitis vinifera muscat of Alexandria and Shiraz cultivars, J. Agric. Food Chem., 2001, 49, 6, 2917-2923, https://doi.org/10.1021/jf001398l . [all data]

Bureau, Baumes, et al., 2000
Bureau, S.M.; Baumes, R.L.; Razungles, A.J., Effects of vine or bunch shading on the glycosylated flavor precursors in grapes of Vitis vinifera L. Cv. Syrah, J. Agric. Food Chem., 2000, 48, 4, 1290-1297, https://doi.org/10.1021/jf990507x . [all data]

Chung, 2000
Chung, H.Y., Volatile flavor components in red fermented soybean (Glycine max) curds, J. Agric. Food Chem., 2000, 48, 5, 1803-1809, https://doi.org/10.1021/jf991272s . [all data]

Chung, 1999
Chung, H.Y., Volatile components in fermented soybean (Glycine max) curds, J. Agric. Food Chem., 1999, 47, 7, 2690-2696, https://doi.org/10.1021/jf981166a . [all data]

Moio and Addeo, 1998
Moio, L.; Addeo, F., Grana Padano cheese aroma, J. Dairy Res., 1998, 65, 2, 317-333, https://doi.org/10.1017/S0022029997002768 . [all data]

Humpf and Schreier, 1991
Humpf, H.-U.; Schreier, P., Bound aroma compounds from the fruit and the leaves of blackberry (Rubus laciniata L.), J. Agric. Food Chem., 1991, 39, 10, 1830-1832, https://doi.org/10.1021/jf00010a028 . [all data]

Krammer, Winterhalter, et al., 1991
Krammer, G.; Winterhalter, P.; Schwab, M.; Schreier, P., Glycosidically bound aroma compounds in the fruits of Prunus species: Apricot (P. armeniaca, L.) peach (P. persica, L.) yellow plum (P. domestica, L. ssp. Syriaca), J. Agric. Food Chem., 1991, 39, 4, 778-781, https://doi.org/10.1021/jf00004a032 . [all data]

Pabst, Barron, et al., 1991
Pabst, A.; Barron, D.; Etiévant, P.; Schreier, P., Studies on the enzymatic hydrolysis of bound aroma constituents from raspberry fruit pulp, J. Agric. Food Chem., 1991, 39, 1, 173-175, https://doi.org/10.1021/jf00001a034 . [all data]

Suárez, Duque, et al., 1991
Suárez, M.; Duque, C.; Wintoch, H.; Schreier, P., Glycosidically bound aroma compounds from the pulp and the peelings of lulo fruit (Solanum vestissimum D.), J. Agric. Food Chem., 1991, 39, 9, 1643-1645, https://doi.org/10.1021/jf00009a022 . [all data]