2,6-Nonadien-1-ol

Van Den Dool and Kratz RI, non-polar column, custom temperature program

View large format table.

Column type Active phase I Reference Comment
CapillaryHP-51180.Boué, Shih, et al., 200350. m/0.2 mm/0.5 μm, He; Program: 40C(3min) => 10C/min => 60C =3C/min => 150C => 20C/min => 250C (5min)

Normal alkane RI, non-polar column, temperature ramp

View large format table.

Column type Active phase I Reference Comment
CapillaryHP-5MS1153.Tzakou, Said, et al., 200630. m/0.25 mm/0.25 μm, He, 3. K/min; Tstart: 60. C; Tend: 280. C

References

Boué, Shih, et al., 2003
Boué, S.M.; Shih, B.Y.; Carter-Wientjes, C.H.; Cleveland, T.E., Identification of volatile compounds in soybean at various developmental stages using solid phase microextraction, J. Agric. Food Chem., 2003, 51, 17, 4873-4876, https://doi.org/10.1021/jf030051q . [all data]

Tzakou, Said, et al., 2006
Tzakou, O.; Said, A.; Farag, A.; Rashed, K., Volatile constituents of Ailanthus excelsa Roxb., Flavour Fragr. J., 2006, 21, 6, 899-901, https://doi.org/10.1002/ffj.1739 . [all data]