α,α,α,2,3,5,6-Heptafluoro-p-xylene

Phase change data

Data compiled by: Robert L. Brown and Stephen E. Stein

Quantity Value Units Method Reference Comment
Tboil417.2KN/AAldrich Chemical Company Inc., 1990

References

Aldrich Chemical Company Inc., 1990
Aldrich Chemical Company Inc., Catalog Handbook of Fine Chemicals, Aldrich Chemical Company, Inc., Milwaukee WI, 1990, 1. [all data]

(editor), 1980
(editor), Koptyug V.A., Atlas of Spectra of Aromatic and Heterocyclic Compounds, 1980, 18, 175. [all data]