manganese trifluoride

Gas phase ion energetics data

Data compiled as indicated in comments:
LLK - Sharon G. Lias, Rhoda D. Levin, and Sherif A. Kafafi
RDSH - Henry M. Rosenstock, Keith Draxl, Bruce W. Steiner, and John T. Herron

Ionization energy determinations

IE (eV) Method Reference Comment
12.6 ± 0.2EIEhlert and Hsia, 1973LLK
12. ± 0.8EIZmbov and Margrave, 1967RDSH

Appearance energy determinations

Ion AE (eV) Other Products MethodReferenceComment
MnF+14.2 ± 0.3?EIZmbov and Margrave, 1967RDSH
F2Mn+14.8 ± 0.2?EIEhlert and Hsia, 1973LLK
MnF2+13.7 ± 0.3FEIZmbov and Margrave, 1967RDSH
Mn+19.5 ± 0.5?EIZmbov and Margrave, 1967RDSH

References

Ehlert and Hsia, 1973
Ehlert, T.C.; Hsia, M., Mass spectrometric and thermochemical studies of the manganese fluorides, J. Fluorine Chem., 1973, 2, 33. [all data]

Zmbov and Margrave, 1967
Zmbov, K.F.; Margrave, J.L., Mass spectrometric studies at high temperatures. XV.Sublimation pressures of chromium, manganese and iron trifluoridcs and the heat of dissociation of Fe,F,(g), J. Inorg. Nucl. Chem., 1967, 29, 673. [all data]