mercury difluoride

Gas phase thermochemistry data

Quantity Value Units Method Reference Comment
Δfgas-70.184kcal/molReviewChase, 1998Data last reviewed in December, 1961
Quantity Value Units Method Reference Comment
gas,1 bar64.935cal/mol*KReviewChase, 1998Data last reviewed in December, 1961

Gas Phase Heat Capacity (Shomate Equation)

Cp° = A + B*t + C*t2 + D*t3 + E/t2
H° − H°298.15= A*t + B*t2/2 + C*t3/3 + D*t4/4 − E/t + F − H
S° = A*ln(t) + B*t + C*t2/2 + D*t3/3 − E/(2*t2) + G
    Cp = heat capacity (cal/mol*K)
    H° = standard enthalpy (kcal/mol)
    S° = standard entropy (cal/mol*K)
    t = temperature (K) / 1000.

View plot Requires a JavaScript / HTML 5 canvas capable browser.

View table.

Temperature (K) 2000. - 6000.
A 14.58890
B 0.267460
C -0.072254
D 0.006154
E -0.161247
F -75.08659
G 81.60681
H -70.18511
ReferenceChase, 1998
Comment Data last reviewed in December, 1961

Condensed phase thermochemistry data

Quantity Value Units Method Reference Comment
Δfliquid-96.773kcal/molReviewChase, 1998Data last reviewed in December, 1961
Quantity Value Units Method Reference Comment
liquid,1 bar32.087cal/mol*KReviewChase, 1998Data last reviewed in December, 1961
Quantity Value Units Method Reference Comment
Δfsolid-101.00kcal/molReviewChase, 1998Data last reviewed in December, 1961
Quantity Value Units Method Reference Comment
solid27.799cal/mol*KReviewChase, 1998Data last reviewed in December, 1961

Liquid Phase Heat Capacity (Shomate Equation)

Cp° = A + B*t + C*t2 + D*t3 + E/t2
H° − H°298.15= A*t + B*t2/2 + C*t3/3 + D*t4/4 − E/t + F − H
S° = A*ln(t) + B*t + C*t2/2 + D*t3/3 − E/(2*t2) + G
    Cp = heat capacity (cal/mol*K)
    H° = standard enthalpy (kcal/mol)
    S° = standard entropy (cal/mol*K)
    t = temperature (K) / 1000.

View plot Requires a JavaScript / HTML 5 canvas capable browser.

View table.

Temperature (K) 918. - 2000.
A 24.40010
B 4.498750×10-8
C -2.810761×10-8
D 5.933540×10-9
E 2.741650×10-9
F -105.8490
G 57.42161
H -96.77280
ReferenceChase, 1998
Comment Data last reviewed in December, 1961

Solid Phase Heat Capacity (Shomate Equation)

Cp° = A + B*t + C*t2 + D*t3 + E/t2
H° − H°298.15= A*t + B*t2/2 + C*t3/3 + D*t4/4 − E/t + F − H
S° = A*ln(t) + B*t + C*t2/2 + D*t3/3 − E/(2*t2) + G
    Cp = heat capacity (cal/mol*K)
    H° = standard enthalpy (kcal/mol)
    S° = standard entropy (cal/mol*K)
    t = temperature (K) / 1000.

View plot Requires a JavaScript / HTML 5 canvas capable browser.

View table.

Temperature (K) 298. - 918.
A 16.40010
B 4.999931
C 0.000129
D -0.000041
E 0.000012
F -106.1120
G 46.15590
H -101.0000
ReferenceChase, 1998
Comment Data last reviewed in December, 1961

References

Chase, 1998
Chase, M.W., Jr., NIST-JANAF Themochemical Tables, Fourth Edition, J. Phys. Chem. Ref. Data, Monograph 9, 1998, 1-1951. [all data]