Nonanoic acid, 3-methylbutyl ester

Van Den Dool and Kratz RI, non-polar column, temperature ramp

View large format table.

Column type Active phase I Reference Comment
Capillary5 % Phenyl methyl siloxane1559.Zaikin, 200930. m/0.25 mm/0.25 μm, 15. K/min, 270. C @ 15. min; Tstart: 60. C

Normal alkane RI, non-polar column, temperature ramp

View large format table.

Column type Active phase I Reference Comment
CapillaryOV-1011527.Camciuc, Bessière, et al., 199850. m/0.22 mm/1. μm, He, 100. C @ 1. min, 1. K/min; Tend: 220. C

Normal alkane RI, non-polar column, custom temperature program

View large format table.

Column type Active phase I Reference Comment
CapillarySE-301533.Vinogradov, 2004Program: not specified

Normal alkane RI, polar column, custom temperature program

View large format table.

Column type Active phase I Reference Comment
CapillaryCarbowax 20M1748.Vinogradov, 2004Program: not specified
CapillaryCarbowax 20M1748.Bais, Dattatreya, et al., 2003He; Program: not specified
CapillaryCarbowax 20M1752.Bais, Dattatreya, et al., 2003He; Program: not specified

References

Zaikin, 2009
Zaikin, V.G., Personal Communication: Retention indices measured during the period 2008 to 2009, 2009. [all data]

Camciuc, Bessière, et al., 1998
Camciuc, M.; Bessière, J.M.; Vilarem, G.; Gaset, A., Volatile components in okra seed coat, Phytochemistry, 1998, 48, 2, 311-315, https://doi.org/10.1016/S0031-9422(97)01127-8 . [all data]

Vinogradov, 2004
Vinogradov, B.A., Production, composition, properties and application of essential oils, 2004, retrieved from http://viness.narod.ru. [all data]

Bais, Dattatreya, et al., 2003
Bais, H.P.; Dattatreya, B.S.; Ravishankar, G.A., Production of volatile compounds by hairy root cultures of Cichorium intybus L under the influence of fungal elicitors and their analysis using solid-phase micro extraction gas chromatography-mass spectrometry, J. Sci. Food Agric., 2003, 83, 8, 769-774, https://doi.org/10.1002/jsfa.1378 . [all data]