Divinyl sulphone

Condensed phase thermochemistry data

Data compiled by: Hussein Y. Afeefy, Joel F. Liebman, and Stephen E. Stein

Quantity Value Units Method Reference Comment
Δfliquid-213.0 ± 4.5kJ/molCcbVoronkov, Klyuchnikov, et al., 1989
Δfliquid-207.1 ± 3.8kJ/molCcrMackle, McNally, et al., 1969
Quantity Value Units Method Reference Comment
Δcliquid-2826.5 ± 3.5kJ/molCcrMackle, McNally, et al., 1969

References

Voronkov, Klyuchnikov, et al., 1989
Voronkov, M.G.; Klyuchnikov, V.A.; Kolabin, S.N.; Shvets, G.N.; Varusin, P.I.; Deryagina, E.N.; Korchevin, N.A.; Tsvetnitskaya, S.I., Thermochemical properties of diorganyl chalcogenides and dichalcogenides RMnR(M = S, Se, Te; n = 1, 2)., Dokl. Phys. Chem. (Engl. Transl.), 1989, 307, 650-653, In original 1139. [all data]

Mackle, McNally, et al., 1969
Mackle, H.; McNally, D.V.; Steele, W.V., Studies in the thermochemistry of sulphones. Part 10. Heats of combustion and formation of several αβ-unsaturated sulphones, Trans. Faraday Soc., 1969, 65, 2060-2068. [all data]