2,2,4-Trichloro-5-[(2-methoxyphenyl)amino]-4-cyclopentene-1,3-dione

Phase change data

Data compiled by: William E. Acree, Jr., James S. Chickos

Enthalpy of vaporization

ΔvapH (kJ/mol) Temperature (K) Method Reference Comment
84.6468.GCSharif'yanova, Sadykova, et al., 1980Based on data from 453. - 483. K.

References

Sharif'yanova, Sadykova, et al., 1980
Sharif'yanova, L.N.; Sadykova, F.M.; Akhmerova, S.G., Khim. Prom-st. Ser. Khlornaya Prom-st., 1980, 16. [all data]