2-tridecenal

Van Den Dool and Kratz RI, polar column, temperature ramp

Data compiled by: NIST Mass Spectrometry Data Center, William E. Wallace, director

Column type CapillaryCapillary
Active phase ZB-WaxZB-Wax
Column length (m) 30.30.
Carrier gas HeHe
Substrate
Column diameter (mm) 0.250.25
Phase thickness (μm) 0.150.15
Tstart (C) 35.35.
Tend (C) 220.220.
Heat rate (K/min) 5.5.
Initial hold (min) 5.5.
Final hold (min) 10.10.
I 1868.1868.
ReferenceLedauphin, Basset, et al., 2006Ledauphin, Saint-Clair, et al., 2004
Comment MSDC-RI MSDC-RI

Kovats' RI, non-polar column, temperature ramp

Data compiled by: NIST Mass Spectrometry Data Center, William E. Wallace, director

Column type CapillaryCapillary
Active phase OV-101OV-101
Column length (m) 50.50.
Carrier gas
Substrate
Column diameter (mm) 0.230.23
Phase thickness (μm)
Tstart (C) 80.80.
Tend (C) 200.200.
Heat rate (K/min) 2.2.
Initial hold (min)
Final hold (min)
I 1553.1553.
ReferenceOhnishi and Shibamoto, 1984Ohnishi and Shibamoto, 1984
Comment MSDC-RI MSDC-RI

References

Ledauphin, Basset, et al., 2006
Ledauphin, J.; Basset, B.; Cohen, S.; Payot, T.; Barillier, D., Identification of trace volatile compounds in freshly distilled Calvados and Cognac: Carbonyl and sulphur compounds, J. Food Comp. Anal., 2006, 19, 1, 28-40, https://doi.org/10.1016/j.jfca.2005.03.001 . [all data]

Ledauphin, Saint-Clair, et al., 2004
Ledauphin, J.; Saint-Clair, J.-F.; Lablanquie, O.; Guichard, H.; Founier, N.; Guichard, E.; Barillier, D., Identification of trace volatile compounds in freshly distilled calvados and cognac using preparative separations coupled with gas chromatography-mass spectrometry, J. Agric. Food Chem., 2004, 52, 16, 5124-5134, https://doi.org/10.1021/jf040052y . [all data]