manganese dichloride

Gas phase ion energetics data

Data compiled as indicated in comments:
LL - Sharon G. Lias and Joel F. Liebman
LLK - Sharon G. Lias, Rhoda D. Levin, and Sherif A. Kafafi

Ionization energy determinations

IE (eV) Method Reference Comment
10.8PELee, Potts, et al., 1980LLK
11.03 ± 0.01PEWang, Niu, et al., 1990Vertical value; LL
10.9PEMacNaughton, Bloor, et al., 1981Vertical value; LLK
11.03PELee, Potts, et al., 1980Vertical value; LLK

References

Lee, Potts, et al., 1980
Lee, E.P.F.; Potts, A.W.; Doran, M.; Hillier, I.H.; Delaney, J.J.; Hawksworth, R.W.; Guest, M.F., Photoelectron spectra and electronic structure of the transition metal dichlorides, MCl2(M = Cr, Mn, Fe, Co, Ni), J. Chem. Soc. Faraday Trans. 2, 1980, 76, 506. [all data]

Wang, Niu, et al., 1990
Wang, L.-S.; Niu, B.; Lee, Y.T.; Shirley, D.A., Electronic structure and chemical bonding of the first row transition metal dichlorides, MnCl2, NiCl2, and ZnCl2: A high resolution photoelectron spectroscopic study, J. Chem. Phys., 1990, 93, 957. [all data]

MacNaughton, Bloor, et al., 1981
MacNaughton, R.M.; Bloor, J.E.; Sherrod, R.E.; Schweitzer, G.K., The He(I) photoelectron psectra of some gaseous 3d-transition metal dihalides, J. Electron Spectrosc. Relat. Phenom., 1981, 22, 1. [all data]