3,4-Dimethoxyphenylacetone

Van Den Dool and Kratz RI, polar column, temperature ramp

View large format table.

Column type Active phase I Reference Comment
CapillaryHP-Innowax2470.Adamiec, Cejpek, et al., 200130. m/0.25 mm/0.25 μm, N2, 5. K/min; Tstart: 60. C; Tend: 220. C

References

Adamiec, Cejpek, et al., 2001
Adamiec, J.; Cejpek, K.; Rossner, J.; Velisek, J., Novel Strecker degradation products of tyrosine and dihydroxyphenylalanine, Czech. J. Food. Sci., 2001, 19, 1, 13-18. [all data]