Silane, methyldiphenyl-

Phase change data

Data compiled as indicated in comments:
BS - Robert L. Brown and Stephen E. Stein
AC - William E. Acree, Jr., James S. Chickos

Quantity Value Units Method Reference Comment
Δvap64.6 ± 0.8kJ/molCVoronkov, Baryshok, et al., 1988AC

Reduced pressure boiling point

Tboil (K) Pressure (bar) Reference Comment
366.60.001PCR Inc., 1990BS

Gas phase ion energetics data

Data compiled as indicated in comments:
LLK - Sharon G. Lias, Rhoda D. Levin, and Sherif A. Kafafi

Ionization energy determinations

IE (eV) Method Reference Comment
8.75 ± 0.15EIGaidis, Briggs, et al., 1971LLK

Appearance energy determinations

Ion AE (eV) Other Products MethodReferenceComment
C13H13Si+10.97 ± 0.12HEIGaidis, Briggs, et al., 1971LLK

References

Voronkov, Baryshok, et al., 1988
Voronkov, M.G.; Baryshok, V.P.; Klyuchnikov, V.A.; Danilova, T.F.; Pepekin, V.I.; Korchagina, A.N.; Khudobin, Yu.I., Thermochemistry of organosilicon compounds, Journal of Organometallic Chemistry, 1988, 345, 1-2, 27-38, https://doi.org/10.1016/0022-328X(88)80231-6 . [all data]

PCR Inc., 1990
PCR Inc., Research Chemicals Catalog 1990-1991, PCR Inc., Gainesville, FL, 1990, 1. [all data]

Gaidis, Briggs, et al., 1971
Gaidis, J.M.; Briggs, P.R.; Shannon, T.W., Mass spectra of disilanes. Phenyl-silicon interaction and silicon-silicon bond strength, J. Phys. Chem., 1971, 75, 974. [all data]