1,2,3-Metheno-1H-benz[f]indene,2,3-dihydro

Gas phase ion energetics data

Data compiled as indicated in comments:
LLK - Sharon G. Lias, Rhoda D. Levin, and Sherif A. Kafafi

Ionization energy determinations

IE (eV) Method Reference Comment
7.71PEGleiter, Gubernator, et al., 1981LLK

References

Gleiter, Gubernator, et al., 1981
Gleiter, R.; Gubernator, K.; Eckert-Maksic, M.; Spanget-Larsen, J.; Bianco, B.; Gandillon, G.; Berger, U., 120. The electronic structure of phenylene and naphthylene bicyclobutanes. Photoelectron spectroscopy and model calculations, Helv. Chim. Acta, 1981, 64, 1312. [all data]