2,4,6,8-Tetramethyl-2,4,6,8-tetraphenyl-[1,3,5,7,2,4,6,8]cyclotetrasiloxane

Phase change data

Data compiled as indicated in comments:
TRC - Thermodynamics Research Center, NIST Boulder Laboratories, Chris Muzny director
AC - William E. Acree, Jr., James S. Chickos

Quantity Value Units Method Reference Comment
Ttriple373.0KN/AMekhtiev and Karasharli, 1981Uncertainty assigned by TRC = 0.1 K; TRC

Enthalpy of fusion

ΔfusH (kcal/mol) Temperature (K) Method Reference Comment
5.884373.4ACDomalski and Hearing, 1996AC

In addition to the Thermodynamics Research Center (TRC) data available from this site, much more physical and chemical property data is available from the following TRC products:

Normal alkane RI, non-polar column, temperature ramp

View large format table.

Column type Active phase I Reference Comment
CapillaryMethyl Silicone2736.Fujimoto, Ohtani, et al., 199025. m/0.25 mm/0.1 μm, He, 5. K/min; Tstart: 40. C; Tend: 350. C

References

Mekhtiev and Karasharli, 1981
Mekhtiev, S.A.; Karasharli, K.A., Analysis of the results of thermodynamic studies of a series of organosilicon compounds, Azerb. Khim. Zhur., 1981, (5), 85-88. [all data]

Domalski and Hearing, 1996
Domalski, Eugene S.; Hearing, Elizabeth D., Heat Capacities and Entropies of Organic Compounds in the Condensed Phase. Volume III, J. Phys. Chem. Ref. Data, 1996, 25, 1, 1, https://doi.org/10.1063/1.555985 . [all data]

Fujimoto, Ohtani, et al., 1990
Fujimoto, S.; Ohtani, H.; Yamagiwa, K.; Tsuge, S., Study on retention behavior of cyclic siloxanes by high resolution pyrolysis-gas chromatography with a fused silica capillary column, J. Hi. Res. Chromatogr., 1990, 13, 6, 397-404, https://doi.org/10.1002/jhrc.1240130603 . [all data]