Tigogenin

Phase change data

Data compiled by: Thermodynamics Research Center, NIST Boulder Laboratories, Chris Muzny director

Quantity Value Units Method Reference Comment
Tfus477.9KN/AAllinger and DaRooge, 1961Uncertainty assigned by TRC = 5. K

In addition to the Thermodynamics Research Center (TRC) data available from this site, much more physical and chemical property data is available from the following TRC products:

Kovats' RI, non-polar column, isothermal

View large format table.

Column type Active phase Temperature (C) I Reference Comment
CapillaryCP Sil 5 CB270.3232.van Gelder, Jonker, et al., 198850. m/0.22 mm/0.12 μm, H2

Normal alkane RI, non-polar column, custom temperature program

View large format table.

Column type Active phase I Reference Comment
CapillaryOV-1, SE-30, Methyl silicone, SP-2100, OV-101, DB-1, etc.3260.Waggott and Davies, 1984Hydrogen; Column length: 50. m; Column diameter: 0.32 mm; Program: not specified

References

Allinger and DaRooge, 1961
Allinger, N.L.; DaRooge, M.A., Conformational Analysis XX. The Configuration of the Acetyl Side Chain of Pregnane-20-one, J. Am. Chem. Soc., 1961, 83, 4256-8. [all data]

van Gelder, Jonker, et al., 1988
van Gelder, W.M.J.; Jonker, H.H.; Huizing, H.J.; Scheffer, J.J.C., Capillary gas chromatography of steroidal alkaloids from Solanaceae. Retention indices and simultaneous flame ionization/nitrogen-specific detection, J. Chromatogr., 1988, 442, 133-145, https://doi.org/10.1016/S0021-9673(00)94463-7 . [all data]

Waggott and Davies, 1984
Waggott, A.; Davies, I.W., Identification of organic pollutants using linear temperature programmed retention indices (LTPRIs) - Part II, 1984, retrieved from http://dwi.defra.gov.uk/research/completed-research/reports/dwi0383.pdf. [all data]