copper sulphate

Condensed phase thermochemistry data

Quantity Value Units Method Reference Comment
Δfsolid-184.4 ± 0.29kcal/molReviewCox, Wagman, et al., 1984CODATA Review value
Δfsolid-184.03kcal/molReviewChase, 1998Data last reviewed in June, 1966
Quantity Value Units Method Reference Comment
solid,1 bar26.10 ± 0.1cal/mol*KReviewCox, Wagman, et al., 1984CODATA Review value
Quantity Value Units Method Reference Comment
solid26.064cal/mol*KReviewChase, 1998Data last reviewed in June, 1966

Solid Phase Heat Capacity (Shomate Equation)

Cp° = A + B*t + C*t2 + D*t3 + E/t2
H° − H°298.15= A*t + B*t2/2 + C*t3/3 + D*t4/4 − E/t + F − H
S° = A*ln(t) + B*t + C*t2/2 + D*t3/3 − E/(2*t2) + G
    Cp = heat capacity (cal/mol*K)
    H° = standard enthalpy (kcal/mol)
    S° = standard entropy (cal/mol*K)
    t = temperature (K) / 1000.

View plot Requires a JavaScript / HTML 5 canvas capable browser.

View table.

Temperature (K) 298. - 2000.
A 20.93164
B 30.94121
C -18.69768
D 4.118428
E -0.449293
F -193.0076
G 40.43571
H -184.0301
ReferenceChase, 1998
Comment Data last reviewed in June, 1966

References

Cox, Wagman, et al., 1984
Cox, J.D.; Wagman, D.D.; Medvedev, V.A., CODATA Key Values for Thermodynamics, Hemisphere Publishing Corp., New York, 1984, 1. [all data]

Chase, 1998
Chase, M.W., Jr., NIST-JANAF Themochemical Tables, Fourth Edition, J. Phys. Chem. Ref. Data, Monograph 9, 1998, 1-1951. [all data]