Potassium bromate

Reaction thermochemistry data

Data compiled by: Hussein Y. Afeefy, Joel F. Liebman, and Stephen E. Stein

Individual Reactions

3Pyridine, 1-oxide + potassium bromide = 3Pyridine + KBrO3

By formula: 3C5H5NO + BrK = 3C5H5N + KBrO3

Quantity Value Units Method Reference Comment
Δr75.0 ± 2.3kcal/molCmShaofeng and Pilcher, 1988solid phase

References

Shaofeng and Pilcher, 1988
Shaofeng, L.; Pilcher, G., Enthalpy of formation of pyridine-N-oxide: the dissociation enthalpy of the (N-O) bond, J. Chem. Thermodyn., 1988, 20, 463-465. [all data]