H2S+

Reaction thermochemistry data

Data compiled by: Michael M. Meot-Ner (Mautner) and Sharon G. Lias

Individual Reactions

(H2S+ • Hydrogen sulfide) + Hydrogen sulfide = (H2S+ • 2Hydrogen sulfide)

By formula: (H2S+ • H2S) + H2S = (H2S+ • 2H2S)

Quantity Value Units Method Reference Comment
Δr4.2kcal/molPIPrest, Tzeng, et al., 1983gas phase
Δr3.2kcal/molPIWalters and Blais, 1981gas phase

H2S+ + Hydrogen sulfide = (H2S+ • Hydrogen sulfide)

By formula: H2S+ + H2S = (H2S+ • H2S)

Quantity Value Units Method Reference Comment
Δr21.2kcal/molPIPrest, Tzeng, et al., 1983gas phase
Δr17.0kcal/molPIWalters and Blais, 1981gas phase

(H2S+ • 2Hydrogen sulfide) + Hydrogen sulfide = (H2S+ • 3Hydrogen sulfide)

By formula: (H2S+ • 2H2S) + H2S = (H2S+ • 3H2S)

Quantity Value Units Method Reference Comment
Δr1.2kcal/molPIWalters and Blais, 1981gas phase

(H2S+ • 3Hydrogen sulfide) + Hydrogen sulfide = (H2S+ • 4Hydrogen sulfide)

By formula: (H2S+ • 3H2S) + H2S = (H2S+ • 4H2S)

Quantity Value Units Method Reference Comment
Δr1.4kcal/molPIWalters and Blais, 1981gas phase

(H2S+ • 4Hydrogen sulfide) + Hydrogen sulfide = (H2S+ • 5Hydrogen sulfide)

By formula: (H2S+ • 4H2S) + H2S = (H2S+ • 5H2S)

Quantity Value Units Method Reference Comment
Δr2.6kcal/molPIWalters and Blais, 1981gas phase

References

Prest, Tzeng, et al., 1983
Prest, H.F.; Tzeng, W.-B.; Brom, J.M., Jr.; Ng, C.Y., Photoionization study of (H2S)2 and (H2S)3, J. Am. Chem. Soc., 1983, 105, 7531. [all data]

Walters and Blais, 1981
Walters, E.A.; Blais, N.C., Molecular beam photoionization of (H2S)n,n = 1 - 7, J. Chem. Phys., 1981, 75, 4208. [all data]