Ditungsten tetrakis(trifluoroacetate)

Gas phase ion energetics data

Data compiled by: Sharon G. Lias, John E. Bartmess, Joel F. Liebman, John L. Holmes, Rhoda D. Levin, and W. Gary Mallard

Ionization energy determinations

IE (eV) Method Reference Comment
6.9PEBancroft, Pellach, et al., 1982
7.39PEChisholm, Clark, et al., 1987Vertical value
7.39PEBancroft, Pellach, et al., 1982Vertical value

References

Bancroft, Pellach, et al., 1982
Bancroft, G.M.; Pellach, E.; Sattelberger, A.P.; McLaughlin, K.W., The photoelectron spectrum of quadruply bonded W2(O2CCF3)4, J. Chem. Soc., Chem. Commun., 1982, 752. [all data]

Chisholm, Clark, et al., 1987
Chisholm, M.H.; Clark, D.L.; Huffman, J.C.; Van Der Sluys, W.G.; Kober, E.M.; Lichtenberger, D.L.; Bursten, B.E., The tungsten-tungsten triple bond. 13. Bisalkyl tetracarboxylates of dimolybdenum and ditungsten. Triple bonds between metal atoms with the valence molecular orbital description 4 2, J. Am. Chem. Soc., 1987, 109, 6796. [all data]