1-Butyne, 3,3-dimethyl-1-phosphinyl-

Gas phase ion energetics data

Data compiled as indicated in comments:
LLK - Sharon G. Lias, Rhoda D. Levin, and Sherif A. Kafafi

Ionization energy determinations

IE (eV) Method Reference Comment
9.05PECabelli, Cowley, et al., 1981Vertical value; LLK

References

Cabelli, Cowley, et al., 1981
Cabelli, D.E.; Cowley, A.H.; Dewar, M.J.S., UPE studies of conjugation involving group 5A elements. 2. Substituted tert-butylacetylenes, J. Am. Chem. Soc., 1981, 103, 3290. [all data]