Tetradecanedinitrile

Phase change data

Data compiled by: William E. Acree, Jr., James S. Chickos

Enthalpy of fusion

ΔfusH (kJ/mol) Temperature (K) Method Reference
40.17309.6DSCBadea, Blanco, et al., 2007

References

Badea, Blanco, et al., 2007
Badea, Elena; Blanco, Ignazio; Della Gatta, Giuseppe, Fusion and solid-to-solid transitions of a homologous series of alkane-α,ω-dinitriles, The Journal of Chemical Thermodynamics, 2007, 39, 10, 1392-1398, https://doi.org/10.1016/j.jct.2007.03.005 . [all data]