C10H16O3

Reaction thermochemistry data

Data compiled by: John E. Bartmess

Individual Reactions

C10H15O3- + Hydrogen cation = C10H16O3

By formula: C10H15O3- + H+ = C10H16O3

Quantity Value Units Method Reference Comment
Δr1429. ± 9.2kJ/molG+TSTaft and Topsom, 1987gas phase; value altered from reference due to change in acidity scale
Quantity Value Units Method Reference Comment
Δr1400. ± 8.4kJ/molIMRETaft and Topsom, 1987gas phase; value altered from reference due to change in acidity scale

Gas phase ion energetics data

Data compiled by: John E. Bartmess

De-protonation reactions

C10H15O3- + Hydrogen cation = C10H16O3

By formula: C10H15O3- + H+ = C10H16O3

Quantity Value Units Method Reference Comment
Δr1429. ± 9.2kJ/molG+TSTaft and Topsom, 1987gas phase; value altered from reference due to change in acidity scale
Quantity Value Units Method Reference Comment
Δr1400. ± 8.4kJ/molIMRETaft and Topsom, 1987gas phase; value altered from reference due to change in acidity scale

References

Taft and Topsom, 1987
Taft, R.W.; Topsom, R.D., The Nature and Analysis of Substituent Effects, Prog. Phys. Org. Chem., 1987, 16, 1. [all data]