NBr2

Vibrational and/or electronic energy levels

Data compiled by: Marilyn E. Jacox

State:   X

Vib.
sym.
 No.   Approximate
 type of mode
 cm-1   Med.   Method   References

b2 3 Asym. stretch 604 Ar IR Kohlmiller and Andrews, 1982

Additional references: Jacox, 1994, page 108

References

Kohlmiller and Andrews, 1982
Kohlmiller, C.K.; Andrews, L., Matrix infrared spectra of the dichloroamidogen and dibromoamidogen free radicals, Inorg. Chem., 1982, 21, 4, 1519, https://doi.org/10.1021/ic00134a049 . [all data]

Jacox, 1994
Jacox, M.E., Vibrational and electronic energy levels of polyatomic transient molecules, American Chemical Society, Washington, DC, 1994, 464. [all data]