Hexethal

Kovats' RI, non-polar column, isothermal

Data compiled by: NIST Mass Spectrometry Data Center, William E. Wallace, director

Column type Packed
Active phase SE-30
Column length (m)
Carrier gas
Substrate
Column diameter (mm)
Phase thickness (μm)
Temperature (C) 200.
I 1835.
ReferenceStead, Gill, et al., 1982
Comment MSDC-RI

References

Stead, Gill, et al., 1982
Stead, A.H.; Gill, R.; Evans, A.T.; Moffat, A.C., Predictions of gas chromatographic retention characteristics of barbiturates from molecular structure, J. Chromatogr., 1982, 234, 2, 277-283, https://doi.org/10.1016/S0021-9673(00)81866-X . [all data]