vanadium trichloride oxide

Vibrational and/or electronic energy levels

Data compiled by: Takehiko Shimanouchi

Symmetry:   C     Symmetry Number σ = 3

 Sym.   No   Approximate   Selected Freq.  Infrared   Raman   Comments
 Species   type of mode   Value   Rating   Value  Phase  Value  Phase

a1 1 VO str 1042  C 1035 VS liq. 1042.5 p gas
a1 2 VCl3 s-str 408  C 408 S liq. 409.5 p gas
a1 3 VCl3 s-deform 163  C 163.0 gas
e 4 VCl3 d-str 502  C 502 VS liq. 503 dp gas
e 5 VCl3 d-deform 246  C 246.0 dp gas
e 6 VCl3 rock 125  C 124.5 gas

Source: Shimanouchi, 1972

References

Shimanouchi, 1972
Shimanouchi, T., Tables of Molecular Vibrational Frequencies Consolidated Volume II, J. Phys. Chem. Ref. Data, 1972, 6, 3, 993-1102. [all data]