Nonahexacontane

Phase change data

Data compiled by: William E. Acree, Jr., James S. Chickos

Enthalpy of vaporization

ΔvapH (kcal/mol) Temperature (K) Method Reference Comment
41.40679.A,EStephenson and Malanowski, 1987Based on data from 664. - 923. K. See also Kudchadker and Zwolinski, 1966.

References

Stephenson and Malanowski, 1987
Stephenson, Richard M.; Malanowski, Stanislaw, Handbook of the Thermodynamics of Organic Compounds, 1987, https://doi.org/10.1007/978-94-009-3173-2 . [all data]

Kudchadker and Zwolinski, 1966
Kudchadker, A.P.; Zwolinski, B.J., Vapor Pressure and Boiling Points of Normal Alkanes, C 21 to C 100 ., J. Chem. Eng. Data, 1966, 11, 2, 253-255, https://doi.org/10.1021/je60029a039 . [all data]