nickel dichloride

Condensed phase thermochemistry data

Quantity Value Units Method Reference Comment
Δfliquid-233.52kJ/molReviewChase, 1998Data last reviewed in September, 1977
Quantity Value Units Method Reference Comment
liquid,1 bar151.79J/mol*KReviewChase, 1998Data last reviewed in September, 1977
Quantity Value Units Method Reference Comment
Δfsolid-304.93kJ/molReviewChase, 1998Data last reviewed in September, 1977
Quantity Value Units Method Reference Comment
solid98.11J/mol*KReviewChase, 1998Data last reviewed in September, 1977

Liquid Phase Heat Capacity (Shomate Equation)

Cp° = A + B*t + C*t2 + D*t3 + E/t2
H° − H°298.15= A*t + B*t2/2 + C*t3/3 + D*t4/4 − E/t + F − H
S° = A*ln(t) + B*t + C*t2/2 + D*t3/3 − E/(2*t2) + G
    Cp = heat capacity (J/mol*K)
    H° = standard enthalpy (kJ/mol)
    S° = standard entropy (J/mol*K)
    t = temperature (K) / 1000.

View plot Requires a JavaScript / HTML 5 canvas capable browser.

View table.

Temperature (K) 1304. - 1800.
A 101.1863
B -0.000003
C 0.000002
D -3.684469×10-7
E -2.956796×10-7
F -276.7252
G 249.1601
H -233.5174
ReferenceChase, 1998
Comment Data last reviewed in September, 1977

Solid Phase Heat Capacity (Shomate Equation)

Cp° = A + B*t + C*t2 + D*t3 + E/t2
H° − H°298.15= A*t + B*t2/2 + C*t3/3 + D*t4/4 − E/t + F − H
S° = A*ln(t) + B*t + C*t2/2 + D*t3/3 − E/(2*t2) + G
    Cp = heat capacity (J/mol*K)
    H° = standard enthalpy (kJ/mol)
    S° = standard entropy (J/mol*K)
    t = temperature (K) / 1000.

View plot Requires a JavaScript / HTML 5 canvas capable browser.

View table.

Temperature (K) 298. - 1100.1100. - 1304.
A 60.62323143.0204
B 89.73676-119.4637
C -131.784365.94946
D 65.885030.320110
E -0.514013-5.757477
F -327.6997-360.2683
G 147.1065276.6565
H -304.9303-304.9303
ReferenceChase, 1998Chase, 1998
Comment Data last reviewed in September, 1977 Data last reviewed in September, 1977

Gas phase thermochemistry data

Quantity Value Units Method Reference Comment
Δfgas-17.67kcal/molReviewChase, 1998Data last reviewed in September, 1977
Quantity Value Units Method Reference Comment
gas,1 bar70.301cal/mol*KReviewChase, 1998Data last reviewed in September, 1977

Gas Phase Heat Capacity (Shomate Equation)

Cp° = A + B*t + C*t2 + D*t3 + E/t2
H° − H°298.15= A*t + B*t2/2 + C*t3/3 + D*t4/4 − E/t + F − H
S° = A*ln(t) + B*t + C*t2/2 + D*t3/3 − E/(2*t2) + G
    Cp = heat capacity (cal/mol*K)
    H° = standard enthalpy (kcal/mol)
    S° = standard entropy (cal/mol*K)
    t = temperature (K) / 1000.

View plot Requires a JavaScript / HTML 5 canvas capable browser.

View table.

Temperature (K) 1800. - 6000.
A 15.51680
B 0.349813
C -0.097489
D 0.009079
E -0.161155
F -22.85190
G 88.07230
H -17.67000
ReferenceChase, 1998
Comment Data last reviewed in September, 1977

Gas phase ion energetics data

Data compiled as indicated in comments:
LL - Sharon G. Lias and Joel F. Liebman
LLK - Sharon G. Lias, Rhoda D. Levin, and Sherif A. Kafafi
RDSH - Henry M. Rosenstock, Keith Draxl, Bruce W. Steiner, and John T. Herron

Ionization energy determinations

IE (eV) Method Reference Comment
10.8PELee, Potts, et al., 1980LLK
11.2 ± 0.5EIMcKinley, 1964RDSH
11.24 ± 0.01PEWang, Niu, et al., 1990Vertical value; LL
11.4PEMacNaughton, Bloor, et al., 1981Vertical value; LLK
11.23PELee, Potts, et al., 1980Vertical value; LLK

Appearance energy determinations

Ion AE (eV) Other Products MethodReferenceComment
NiCl+12.7 ± 0.5ClEIMcKinley, 1964RDSH
Ni+15.7 ± 0.57?EIMcKinley, 1964RDSH

References

Chase, 1998
Chase, M.W., Jr., NIST-JANAF Themochemical Tables, Fourth Edition, J. Phys. Chem. Ref. Data, Monograph 9, 1998, 1-1951. [all data]