Al4P radical

Gas phase ion energetics data

Data compiled by: John E. Bartmess

Electron affinity determinations

EA (eV) Method Reference Comment
1.9800 ± 0.0070LPESGomez, Taylor, et al., 2001Vertical Detachment Energy: 2.40±0.025 eV

References

Gomez, Taylor, et al., 2001
Gomez, H.; Taylor, T.R.; Neumark, D.M., Anion photoelectron spectroscopy of aluminum phosphide clusters, J. Phys. Chem. A, 2001, 105, 28, 6886-6893, https://doi.org/10.1021/jp0105544 . [all data]