iron trichloride

Gas phase thermochemistry data

Quantity Value Units Method Reference Comment
Δfgas-253.13kJ/molReviewChase, 1998Data last reviewed in June, 1965
Quantity Value Units Method Reference Comment
gas,1 bar344.20J/mol*KReviewChase, 1998Data last reviewed in June, 1965

Gas Phase Heat Capacity (Shomate Equation)

Cp° = A + B*t + C*t2 + D*t3 + E/t2
H° − H°298.15= A*t + B*t2/2 + C*t3/3 + D*t4/4 − E/t + F − H
S° = A*ln(t) + B*t + C*t2/2 + D*t3/3 − E/(2*t2) + G
    Cp = heat capacity (J/mol*K)
    H° = standard enthalpy (kJ/mol)
    S° = standard entropy (J/mol*K)
    t = temperature (K) / 1000.

View plot Requires a JavaScript / HTML 5 canvas capable browser.

View table.

Temperature (K) 1500. - 6000.
A 82.90805
B 0.202237
C -0.054914
D 0.004692
E -0.471478
F -279.4410
G 441.8178
H -253.1324
ReferenceChase, 1998
Comment Data last reviewed in June, 1965

Condensed phase thermochemistry data

Quantity Value Units Method Reference Comment
Δfliquid-362.82kJ/molReviewChase, 1998Data last reviewed in June, 1965
Quantity Value Units Method Reference Comment
liquid,1 bar200.66J/mol*KReviewChase, 1998Data last reviewed in June, 1965
Quantity Value Units Method Reference Comment
Δfsolid-399.41kJ/molReviewChase, 1998Data last reviewed in June, 1965
Quantity Value Units Method Reference Comment
solid142.22J/mol*KReviewChase, 1998Data last reviewed in June, 1965

Liquid Phase Heat Capacity (Shomate Equation)

Cp° = A + B*t + C*t2 + D*t3 + E/t2
H° − H°298.15= A*t + B*t2/2 + C*t3/3 + D*t4/4 − E/t + F − H
S° = A*ln(t) + B*t + C*t2/2 + D*t3/3 − E/(2*t2) + G
    Cp = heat capacity (J/mol*K)
    H° = standard enthalpy (kJ/mol)
    S° = standard entropy (J/mol*K)
    t = temperature (K) / 1000.

View plot Requires a JavaScript / HTML 5 canvas capable browser.

View table.

Temperature (K) 577. - 1500.
A 133.8880
B 0.000000
C 0.000000
D 0.000000
E 0.000000
F -402.7343
G 362.6829
H -362.8156
ReferenceChase, 1998
Comment Data last reviewed in June, 1965

Solid Phase Heat Capacity (Shomate Equation)

Cp° = A + B*t + C*t2 + D*t3 + E/t2
H° − H°298.15= A*t + B*t2/2 + C*t3/3 + D*t4/4 − E/t + F − H
S° = A*ln(t) + B*t + C*t2/2 + D*t3/3 − E/(2*t2) + G
    Cp = heat capacity (J/mol*K)
    H° = standard enthalpy (kJ/mol)
    S° = standard entropy (J/mol*K)
    t = temperature (K) / 1000.

View plot Requires a JavaScript / HTML 5 canvas capable browser.

View table.

Temperature (K) 298. - 577.
A 979.1104
B -4704.364
C 9295.174
D -6246.963
E -12.49577
F -593.9774
G 2301.472
H -399.4055
ReferenceChase, 1998
Comment Data last reviewed in June, 1965

References

Chase, 1998
Chase, M.W., Jr., NIST-JANAF Themochemical Tables, Fourth Edition, J. Phys. Chem. Ref. Data, Monograph 9, 1998, 1-1951. [all data]